{"text_format":"1","workbook":"xlsx","n_sheets":4,"sheets":["int","01","02","Foglio6"],"not_rendered":{"charts":2,"images":4,"macros":1,"external_links":0,"defined_names":2,"comments":0,"pivot_tables":0},"unopened":[],"bounds":{"document_bytes":16777216,"sheet_cells":100000,"rows_first":2000,"rows_last":500,"rows_between":2000,"halvings":0,"cell_chars":16384,"cell_head_chars":4096},"cells_cut":0,"cells_raw":0,"read":"whole","date_system":"1900"}

{"sheet":"int","index":0,"n_rows":8,"n_cols":3,"rows_kept":8,"cut":false,"hidden":false,"merged":[]}
[]
[null,null,"Calcolo baricentro di una spezzata"]
[]
[]
[]
[]
[]
[null,null,"agg. 02.01.2015"]

{"sheet":"01","index":1,"n_rows":6,"n_cols":22,"rows_kept":6,"cut":false,"hidden":false,"merged":[]}
[null,"Vertici spezzata"]
[null,"A","B","C","D","E","F","G","H","I","L","M","N","O","P","Q","R","S","T","U","V","Z"]
["x (cm)",-2,8,8,1,-7,-7]
["y (cm)",5,6,-4,-4,-6,1]
[null,null,null,1]
[null,null,null,-4]

{"sheet":"02","index":2,"n_rows":97,"n_cols":85,"rows_kept":97,"cut":false,"hidden":false,"merged":[[21,31,22,31],[13,32,14,32],[15,32,16,32],[17,19,18,19],[17,20,18,20],[19,20,20,20],[13,53,14,53],[15,53,16,53],[17,53,18,53],[19,53,20,53],[21,53,22,53],[11,30,12,30],[13,30,14,30],[15,30,16,30],[17,30,18,30],[19,30,20,30],[21,30,22,30],[11,40,12,40],[13,40,14,40],[15,40,16,40],[17,40,18,40],[19,40,20,40],[21,40,22,40],[13,31,14,31],[15,31,16,31],[17,31,18,31],[19,31,20,31],[9,19,10,19],[19,19,20,19],[21,19,22,19],[19,23,20,23],[19,24,20,24],[21,23,22,23],[21,24,22,24],[9,20,10,20],[11,19,12,19],[11,20,12,20],[13,19,14,19],[13,20,14,20],[15,19,16,19],[15,20,16,20],[9,23,10,23],[9,24,10,24],[11,23,12,23],[11,24,12,24],[13,23,14,23],[13,24,14,24],[15,23,16,23],[15,24,16,24],[17,23,18,23],[17,24,18,24],[5,46,6,46],[21,20,22,20],[25,0,26,13],[9,14,10,14],[11,14,12,14],[13,14,14,14],[15,14,16,14],[17,14,18,14],[19,14,20,14],[21,14,22,14],[9,15,10,15],[11,15,12,15],[13,15,14,15],[15,15,16,15],[17,15,18,15],[19,15,20,15],[21,15,22,15],[9,17,10,17],[11,17,12,17],[13,17,14,17],[15,17,16,17],[17,17,18,17],[19,17,20,17],[21,17,22,17],[3,33,4,33],[3,34,4,34],[5,32,6,32],[5,33,6,33],[5,34,6,34],[5,35,6,35],[5,36,6,36],[5,37,6,37],[5,38,6,38],[3,35,4,35],[3,36,4,36],[3,37,4,37],[3,38,4,38],[5,19,6,19],[5,20,6,20],[3,30,4,30],[5,30,6,30],[3,23,4,23],[3,24,4,24],[3,19,4,19],[3,20,4,20],[3,29,4,29],[5,25,6,25],[5,26,6,26],[5,27,6,27],[5,28,6,28],[5,29,6,29],[5,23,6,23],[5,24,6,24],[1,14,2,14],[1,15,2,15],[1,16,2,16],[3,14,4,14],[3,15,4,15],[5,14,6,14],[5,15,6,15],[3,18,4,18],[5,18,6,18],[3,17,4,17],[5,17,6,17],[9,29,10,29],[7,25,8,25],[7,26,8,26],[7,27,8,27],[7,28,8,28],[7,29,8,29],[3,25,4,25],[3,26,4,26],[3,27,4,27],[3,28,4,28],[15,29,16,29],[13,25,14,25],[13,26,14,26],[13,27,14,27],[13,28,14,28],[13,29,14,29],[11,25,12,25],[11,26,12,26],[11,27,12,27],[11,28,12,28],[11,29,12,29],[21,29,22,29],[19,25,20,25],[19,26,20,26],[19,27,20,27],[19,28,20,28],[19,29,20,29],[17,25,18,25],[17,26,18,26],[17,27,18,27],[17,28,18,28],[17,29,18,29],[7,14,8,14],[7,15,8,15],[7,17,8,17],[7,18,8,18],[7,19,8,19],[21,25,22,25],[21,26,22,26],[21,27,22,27],[21,28,22,28],[15,25,16,25],[15,26,16,26],[15,27,16,27],[15,28,16,28],[9,25,10,25],[9,26,10,26],[9,27,10,27],[9,28,10,28],[9,18,10,18],[11,18,12,18],[13,18,14,18],[15,18,16,18],[17,18,18,18],[19,18,20,18],[21,18,22,18],[7,20,8,20],[7,23,8,23],[7,24,8,24],[7,30,8,30],[7,31,8,31],[7,32,8,32],[7,33,8,33],[7,34,8,34],[7,35,8,35],[7,40,8,40],[5,47,6,47],[5,49,6,49],[5,50,6,50],[3,48,4,48],[5,48,6,48],[7,44,8,44],[7,45,8,45],[5,39,6,39],[5,40,6,40],[3,39,4,39],[3,40,4,40],[3,42,4,42],[5,42,6,42],[3,44,4,44],[3,45,4,45],[5,44,6,44],[5,45,6,45],[3,43,4,43],[5,43,6,43],[3,46,4,46],[3,47,4,47],[3,49,4,49],[3,50,4,50],[9,30,10,30],[9,31,10,31],[9,32,10,32],[9,33,10,33],[9,34,10,34],[9,35,10,35],[9,36,10,36],[9,37,10,37],[9,38,10,38],[11,49,12,49],[11,53,12,53],[11,46,12,46],[11,48,12,48],[11,50,12,50],[3,31,4,31],[5,31,6,31],[3,32,4,32],[7,53,8,53],[9,39,10,39],[9,40,10,40],[9,42,10,42],[9,43,10,43],[7,46,8,46],[7,47,8,47],[7,48,8,48],[7,49,8,49],[7,50,8,50],[7,42,8,42],[7,43,8,43],[7,36,8,36],[7,37,8,37],[7,38,8,38],[7,39,8,39],[9,44,10,44],[9,45,10,45],[9,46,10,46],[9,47,10,47],[9,48,10,48],[11,31,12,31],[11,32,12,32],[11,33,12,33],[11,34,12,34],[11,35,12,35],[11,36,12,36],[11,37,12,37],[11,38,12,38],[11,39,12,39],[11,43,12,43],[11,45,12,45],[11,47,12,47],[15,33,16,33],[15,34,16,34],[15,35,16,35],[15,36,16,36],[15,37,16,37],[15,38,16,38],[15,39,16,39],[9,49,10,49],[19,34,20,34],[19,35,20,35],[19,36,20,36],[19,37,20,37],[19,38,20,38],[19,39,20,39],[13,33,14,33],[13,34,14,34],[13,35,14,35],[13,36,14,36],[13,37,14,37],[13,38,14,38],[13,39,14,39],[13,43,14,43],[15,43,16,43],[17,43,18,43],[21,32,22,32],[21,33,22,33],[21,34,22,34],[21,35,22,35],[21,36,22,36],[21,37,22,37],[21,38,22,38],[21,39,22,39],[11,42,12,42],[13,42,14,42],[15,42,16,42],[17,42,18,42],[19,42,20,42],[21,42,22,42],[17,32,18,32],[17,33,18,33],[17,34,18,34],[17,35,18,35],[17,36,18,36],[17,37,18,37],[17,38,18,38],[17,39,18,39],[19,32,20,32],[19,33,20,33],[19,43,20,43],[21,43,22,43],[11,44,12,44],[13,44,14,44],[15,44,16,44],[17,44,18,44],[19,44,20,44],[21,44,22,44],[13,45,14,45],[15,45,16,45],[17,45,18,45],[19,45,20,45],[21,45,22,45],[13,46,14,46],[15,46,16,46],[17,46,18,46],[19,46,20,46],[21,46,22,46],[13,47,14,47],[15,47,16,47],[17,47,18,47],[19,47,20,47],[21,47,22,47],[13,48,14,48],[15,48,16,48],[17,48,18,48],[19,48,20,48],[21,48,22,48],[13,49,14,49],[15,49,16,49],[17,49,18,49],[19,49,20,49],[21,49,22,49],[13,50,14,50],[15,50,16,50],[17,50,18,50],[19,50,20,50],[21,50,22,50],[3,70,4,70],[5,70,6,70],[7,70,8,70],[9,70,10,70],[11,70,12,70],[13,70,14,70],[15,70,16,70],[17,70,18,70],[19,70,20,70],[21,70,22,70],[9,50,10,50],[9,53,10,53],[3,53,4,53],[5,53,6,53],[21,71,22,71],[3,72,4,72],[5,72,6,72],[7,72,8,72],[9,72,10,72],[11,72,12,72],[13,72,14,72],[15,72,16,72],[17,72,18,72],[19,72,20,72],[21,72,22,72],[3,71,4,71],[5,71,6,71],[7,71,8,71],[9,71,10,71],[11,71,12,71],[13,71,14,71],[15,71,16,71],[17,71,18,71],[19,71,20,71],[21,73,22,73],[3,74,4,74],[5,74,6,74],[7,74,8,74],[9,74,10,74],[11,74,12,74],[13,74,14,74],[15,74,16,74],[17,74,18,74],[19,74,20,74],[21,74,22,74],[3,73,4,73],[5,73,6,73],[7,73,8,73],[9,73,10,73],[11,73,12,73],[13,73,14,73],[15,73,16,73],[17,73,18,73],[19,73,20,73],[19,77,20,77],[21,77,22,77],[5,75,6,75],[3,75,4,75],[3,76,4,76],[5,76,6,76],[7,76,8,76],[9,76,10,76],[11,76,12,76],[13,76,14,76],[15,76,16,76],[7,75,8,75],[9,75,10,75],[11,75,12,75],[13,75,14,75],[15,75,16,75],[17,75,18,75],[19,75,20,75],[21,75,22,75],[3,78,4,78],[5,78,6,78],[7,78,8,78],[9,78,10,78],[11,78,12,78],[13,78,14,78],[15,78,16,78],[17,78,18,78],[19,78,20,78],[21,78,22,78],[17,76,18,76],[19,76,20,76],[21,76,22,76],[3,77,4,77],[5,77,6,77],[7,77,8,77],[9,77,10,77],[11,77,12,77],[13,77,14,77],[15,77,16,77],[17,77,18,77],[21,79,22,79],[3,80,4,80],[5,80,6,80],[7,80,8,80],[9,80,10,80],[11,80,12,80],[13,80,14,80],[15,80,16,80],[17,80,18,80],[19,80,20,80],[21,80,22,80],[3,79,4,79],[5,79,6,79],[7,79,8,79],[9,79,10,79],[11,79,12,79],[13,79,14,79],[15,79,16,79],[17,79,18,79],[19,79,20,79],[21,81,22,81],[3,82,4,82],[5,82,6,82],[7,82,8,82],[9,82,10,82],[11,82,12,82],[13,82,14,82],[15,82,16,82],[17,82,18,82],[19,82,20,82],[21,82,22,82],[3,81,4,81],[5,81,6,81],[7,81,8,81],[9,81,10,81],[11,81,12,81],[13,81,14,81],[15,81,16,81],[17,81,18,81],[19,81,20,81],[21,83,22,83],[3,84,4,84],[5,84,6,84],[7,84,8,84],[9,84,10,84],[11,84,12,84],[13,84,14,84],[15,84,16,84],[17,84,18,84],[19,84,20,84],[21,84,22,84],[3,83,4,83],[5,83,6,83],[7,83,8,83],[9,83,10,83],[11,83,12,83],[13,83,14,83],[15,83,16,83],[17,83,18,83],[19,83,20,83]]}
["A","B","C","D","E","F","G","H","I","L","M","N","O","P",null,"segmento","arco circ.","centro dx","centro sx"]
[null,"Definizione Figure Elementari",null,null,null,null,null,null,null,null,null,null,null,null,"n° ","Figura","n°","R",null,"ω","α","x","y","Δx","Δy","m","x","y","Sx=m∙y","Sy=m∙x","IJ","θ(IJ)","Δx>0","Δx<0","Δx<0","Δx>0","Δx=0","Δx=0","Δx>0","Δx<0","θ(ij)",null,"θ(iO)","θ(iO)","Xo","Yo","GO","θ(OG)","θ(OG)","xG","yG",null,null,"curva",null,null,null,null,null,null,null,null,"segmento",null,null,null,null,null,null,null,"massa segmento","x segmento","y segmento","massa arco","distanza centro-baricentro arco","angolo diretione θ(OG)","x arco","y arco"]
[null,null,null,null,null,null,null,null,null,null,null,null,null,null,null,null,null,"cm",null,"rad.","rad.","cm","cm","cm","cm","cm","cm","cm","cm",null,"m","rad.","Δy>0","Δy>0","Δy<0","Δy<0","Δy>0;","Δy<0","Δy=0","Δy<0","rad.",null,"rad.","rad.","cm","cm","cm","rad.","rad.","cm","cm",null,null,"θ(OI)","P1","P2","P3","P4","P5","P6","P7",null,"P1","P2","P3","P4","P5","P6","P7"]
[null,null,null,null,null,null,null,null,null,null,null,null,null,null,"1","segmento","A",null,null,{"$f":"IF(OR(P4=\"\",P4=\"segmento\"),\"\",ASIN(0.5*AE4/R4))","v":""},{"$f":"IF(OR(P4=\"\",P4=\"segmento\"),\"\",PI()/2-T4)","v":""},{"$f":"IF(Q4=\"\",\"\",LOOKUP(Q4,'01'!$B$2:$V$2,'01'!$B$3:$V$3))","v":-2},{"$f":"IF(Q4=\"\",\"\",LOOKUP(Q4,'01'!$B$2:$V$2,'01'!$B$4:$V$4))","v":5},{"$f":"IF(P4=\"\",\"\",V5-V4)","v":10},{"$f":"IF(P4=\"\",\"\",W5-W4)","v":1},{"$f":"IF(P4=\"\",\"\",IF(P4=\"segmento\",SQRT(X4^2+Y4^2),R4*2*T4))","v":10.04987562112089},{"$f":"IF(P4=\"\",\"\",IF(P4=\"segmento\",(V4+V5)/2,AX4))","v":3},{"$f":"IF(P4=\"\",\"\",IF(P4=\"segmento\",(W4+W5)/2,AY4))","v":5.5},{"$f":"IF(P4=\"\",\"\",Z4*AB4)","v":55.274315916164895},{"$f":"IF(P4=\"\",\"\",Z4*AA4)","v":30.14962686336267},{"$f":"IF(P4=\"\",\"\",SQRT(X4^2+Y4^2))","v":10.04987562112089},{"$f":"ATAN(Y4/X4)","v":9.9668652491162038E-2},{"$f":"IF(AND(X4>0,Y4>0),AF4,\"\")","v":9.9668652491162038E-2},{"$f":"IF(AND(X4<0,Y4>0),AF4+PI(),\"\")","v":""},{"$f":"IF(AND(X4<0,Y4<0),AF4+PI(),\"\")","v":""},{"$f":"IF(AND(X4>0,Y4<0),AF4+2*PI(),\"\")","v":""},{"$f":"IF(AND(X4=0,Y4>0),PI()/2,\"\")","v":""},{"$f":"IF(AND(X4=0,Y4<0),1.5*PI(),\"\")","v":""},{"$f":"IF(AND(X4>0,Y4=0),0,\"\")","v":""},{"$f":"IF(AND(X4<0,Y4=0),PI(),\"\")","v":""},{"$f":"IF(P4=\"\",\"\",MAXA(AG4:AN5))","v":9.9668652491162038E-2},null,{"$f":"IF(OR(P4=\"\",P4=\"segmento\"),\"\",IF(S4=\"centro sx\",AO4+U4,2*PI()-(U4-AO4)))","v":""},{"$f":"IF(OR(P4=\"\",P4=\"segmento\"),\"\",IF(AQ4>2*PI(),AQ4-2*PI(),AQ4))","v":""},{"$f":"IF(OR(P4=\"\",P4=\"segmento\"),\"\",V4+R4*COS(AR4))","v":""},{"$f":"IF(OR(P4=\"\",P4=\"segmento\"),\"\",W4+R4*SIN(AR4))","v":""},{"$f":"IF(OR(P4=\"\",P4=\"segmento\"),\"\",R4*SIN(T4)/T4)","v":""},{"$f":"IF(OR(P4=\"\",P4=\"segmento\"),\"\",AR4+PI()+T4)","v":""},{"$f":"IF(OR(P4=\"\",P4=\"segmento\"),\"\",BB4+T4)","v":""},{"$f":"IF(OR(P4=\"\",P4=\"segmento\"),\"\",IF(S4=\"centro sx\",AS4+AU4*COS(BB4+T4*3/3),AS4+AU4*COS(BB4-T4*3/3)))","v":""},{"$f":"IF(OR(P4=\"\",P4=\"segmento\"),\"\",IF(S4=\"centro sx\",AT4+AU4*SIN(BB4+T4*3/3),AT4+AU4*SIN(BB4-T4*3/3)))","v":""},null,"x",{"$f":"IF(AR4-PI()<0,AR4+PI(),AR4-PI())","v":{"$error":"#VALUE!"}},{"$f":"IF(S4=\"centro sx\",AS4+R4*COS(BB4+T4*0/3),AS4+R4*COS(BB4-T4*0/3))","v":{"$error":"#VALUE!"}},{"$f":"IF($S$4=\"centro sx\",$AS$4+$R$4*COS($BB$4+$T4*1/3),$AS$4+$R$4*COS($BB$4-$T4*1/3))","v":{"$error":"#VALUE!"}},{"$f":"IF($S$4=\"centro sx\",$AS$4+$R$4*COS($BB$4+$T4*2/3),$AS$4+$R$4*COS($BB$4-$T4*2/3))","v":{"$error":"#VALUE!"}},{"$f":"IF($S$4=\"centro sx\",$AS$4+$R$4*COS($BB$4+$T4*3/3),$AS$4+$R$4*COS($BB$4-$T4*3/3))","v":{"$error":"#VALUE!"}},{"$f":"IF($S$4=\"centro sx\",$AS$4+$R$4*COS($BB$4+$T4*4/3),$AS$4+$R$4*COS($BB$4-$T4*4/3))","v":{"$error":"#VALUE!"}},{"$f":"IF($S$4=\"centro sx\",$AS$4+$R$4*COS($BB$4+$T4*5/3),$AS$4+$R$4*COS($BB$4-$T4*5/3))","v":{"$error":"#VALUE!"}},{"$f":"IF($S$4=\"centro sx\",$AS$4+$R$4*COS($BB$4+$T4*6/3),$AS$4+$R$4*COS($BB$4-$T4*6/3))","v":{"$error":"#VALUE!"}},null,{"$f":"V4","v":-2},{"$f":"BK4+AE4*1/6*COS(AO4)","v":-0.33333333333333348},{"$f":"BK4+AE4*2/6*COS(AO4)","v":1.333333333333333},{"$f":"BK4+AE4*3/6*COS(AO4)","v":3},{"$f":"BK4+AE4*4/6*COS(AO4)","v":4.6666666666666661},{"$f":"BK4+AE4*5/6*COS(AO4)","v":6.3333333333333321},{"$f":"BK4+AE4*6/6*COS(AO4)","v":8},null,{"$f":"CONCATENATE(\"m\",O4,\" = √[(x\",Q5,\"-x\",Q4,\")²+(y\",Q5,\"-y\",Q4,,\")²] = √{[(\",FIXED(V5),\")-(\",,FIXED(V4),\")]²+[(\",,FIXED(W5),\")-(\",,FIXED(W4),\")]²} = \",FIXED(Z4),\" cm\")","v":"m1 = √[(xB-xA)²+(yB-yA)²] = √{[(8.00)-(-2.00)]²+[(6.00)-(5.00)]²} = 10.05 cm"},{"$f":"CONCATENATE(\"x\",O4,\" = (x\",Q5,\")+(x\",Q4,\")/2 = [(\",FIXED(W4),\")+(\",FIXED(V4),\")]/2 = \",FIXED(AA4),\" cm\")","v":"x1 = (xB)+(xA)/2 = [(5.00)+(-2.00)]/2 = 3.00 cm"},{"$f":"CONCATENATE(\"y\",O4,\" = (y\",Q5,\"+y\",Q4,\")/2 = [(\",FIXED(W5),\")+(\",FIXED(W4),\")]/2 = \",FIXED(AB4),\" cm\")","v":"y1 = (yB+yA)/2 = [(6.00)+(5.00)]/2 = 5.50 cm"},{"$f":"CONCATENATE(\"m\",O4,\" =  R∙2ω = \",FIXED(R4),\"x2x\",FIXED(T4,4),\" = \",FIXED(Z4),\" cm\")","v":{"$error":"#VALUE!"}},{"$f":"CONCATENATE(\"OG\",O4,\" =  R∙sen(α)/α(rad) = \",FIXED(R4),\"xsen(\",FIXED(T4,4),\"/\",FIXED(T4,4),\" = \",FIXED(AU4),\" cm\")","v":{"$error":"#VALUE!"}},{"$f":"CONCATENATE(\"θ(OG) = \",FIXED(AW4,4),\" rad = \",FIXED(DEGREES(AW4),2),\"° deg\")","v":{"$error":"#VALUE!"}},{"$f":"CONCATENATE(\"x\",O4,\" = XO + OG∙cos[θ(OG)] = \",FIXED(AS4),\"+\",FIXED(AU4),\"xcos(\",FIXED(DEGREES(AW4),4),\"°) = \",FIXED(AX4),\" cm\")","v":{"$error":"#VALUE!"}},{"$f":"CONCATENATE(\"y\",O4,\" = yO + OG∙sen[θ(OG)] = \",FIXED(AT4),\"+\",FIXED(AU4),\"xcos(\",FIXED(DEGREES(AW4),4),\"°) = \",FIXED(AY4),\" cm\")","v":{"$error":"#VALUE!"}},{"$f":"IF(P4=\"\",\"\",IF(P4=\"segmento\",BS4,BV4))","v":"m1 = √[(xB-xA)²+(yB-yA)²] = √{[(8.00)-(-2.00)]²+[(6.00)-(5.00)]²} = 10.05 cm"},{"$f":"IF(P4=\"\",\"\",IF(P4=\"segmento\",BT4,BY4))","v":"x1 = (xB)+(xA)/2 = [(5.00)+(-2.00)]/2 = 3.00 cm"},{"$f":"IF(P4=\"\",\"\",IF(P4=\"segmento\",BU4,BZ4))","v":"y1 = (yB+yA)/2 = [(6.00)+(5.00)]/2 = 5.50 cm"},{"$f":"IF(OR(P4=\"\",P4=\"segmento\"),\"\",BW4)","v":""},{"$f":"IF(OR(P4=\"\",P4=\"segmento\"),\"\",BX4)","v":""},{"$f":"IF(P4=\"\",\"\",CONCATENATE(\"S\",O4,\"x = m\",O4,\"∙y\",O4,\" = \",FIXED(Z4),\"x(\",FIXED(AB4),\") = \",FIXED(AD4),\" cm²\"))","v":"S1x = m1∙y1 = 10.05x(5.50) = 30.15 cm²"},{"$f":"IF(P4=\"\",\"\",CONCATENATE(\"S\",O4,\"y = m\",O4,\"∙x\",O4,\" = \",FIXED(Z4),\"x(\",FIXED(AA4),\") = \",FIXED(AD4),\" cm²\"))","v":"S1y = m1∙x1 = 10.05x(3.00) = 30.15 cm²"}]
[null,null,null,null,null,null,null,null,null,null,null,null,null,null,null,null,"B",null,null,null,null,{"$f":"IF(Q5=\"\",\"\",LOOKUP(Q5,'01'!$B$2:$V$2,'01'!$B$3:$V$3))","v":8},{"$f":"IF(Q5=\"\",\"\",LOOKUP(Q5,'01'!$B$2:$V$2,'01'!$B$4:$V$4))","v":6},null,null,null,null,null,null,null,null,null,null,null,null,null,{"$f":"IF(AND(X5=0,Y5>0),90,\"\")","v":""},{"$f":"IF(AND(X5=0,Y5<0),270,\"\")","v":""},"",{"$f":"IF(AND(X5<0,Y5=0),180,\"\")","v":""},{"$f":"MAXA(AF5:AM5)","v":0},null,null,null,null,null,null,null,null,{"$f":"IF($S$4=\"centro sx\",$AS$4+$R$4*COS($BB$4+$T5*3/3),$AS$4+$R$4*COS($BB$4-$T5*3/3))","v":{"$error":"#VALUE!"}},{"$f":"IF($S$4=\"centro sx\",$AT$4+$R$4*SIN($BB$4+$T$4*3/3),$AT$4+$R$4*SIN($BB$4-$T$4*3/3))","v":{"$error":"#VALUE!"}},null,"y",null,{"$f":"IF(S4=\"centro sx\",AT4+R4*SIN(BB4+T4*0/3),AT4+R4*SIN(BB4-T4*0/3))","v":{"$error":"#VALUE!"}},{"$f":"IF($S$4=\"centro sx\",$AT$4+$R$4*SIN($BB$4+$T$4*1/3),$AT$4+$R$4*SIN($BB$4-$T$4*1/3))","v":{"$error":"#VALUE!"}},{"$f":"IF($S$4=\"centro sx\",$AT$4+$R$4*SIN($BB$4+$T$4*2/3),$AT$4+$R$4*SIN($BB$4-$T$4*2/3))","v":{"$error":"#VALUE!"}},{"$f":"IF($S$4=\"centro sx\",$AT$4+$R$4*SIN($BB$4+$T$4*3/3),$AT$4+$R$4*SIN($BB$4-$T$4*3/3))","v":{"$error":"#VALUE!"}},{"$f":"IF($S$4=\"centro sx\",$AT$4+$R$4*SIN($BB$4+$T$4*4/3),$AT$4+$R$4*SIN($BB$4-$T$4*4/3))","v":{"$error":"#VALUE!"}},{"$f":"IF($S$4=\"centro sx\",$AT$4+$R$4*SIN($BB$4+$T$4*5/3),$AT$4+$R$4*SIN($BB$4-$T$4*5/3))","v":{"$error":"#VALUE!"}},{"$f":"IF($S$4=\"centro sx\",$AT$4+$R$4*SIN($BB$4+$T$4*6/3),$AT$4+$R$4*SIN($BB$4-$T$4*6/3))","v":{"$error":"#VALUE!"}},null,{"$f":"W4","v":5},{"$f":"BK5+AE4*1/6*SIN(AO4)","v":5.166666666666667},{"$f":"BK5+AE4*2/6*SIN(AO4)","v":5.333333333333333},{"$f":"BK5+AE4*3/6*SIN(AO4)","v":5.5},{"$f":"BK5+AE4*4/6*SIN(AO4)","v":5.666666666666667},{"$f":"BK5+AE4*5/6*SIN(AO4)","v":5.833333333333333},{"$f":"BK5+AE4*6/6*SIN(AO4)","v":6}]
[null,null,null,null,null,null,null,null,null,null,null,null,null,null,"2","arco circ.","B",5,"centro dx",{"$f":"IF(OR(P6=\"\",P6=\"segmento\"),\"\",ASIN(0.5*AE6/R6))","v":1.5707963267948966},{"$f":"IF(OR(P6=\"\",P6=\"segmento\"),\"\",PI()/2-T6)","v":0},{"$f":"IF(Q6=\"\",\"\",LOOKUP(Q6,'01'!$B$2:$V$2,'01'!$B$3:$V$3))","v":8},{"$f":"IF(Q6=\"\",\"\",LOOKUP(Q6,'01'!$B$2:$V$2,'01'!$B$4:$V$4))","v":6},{"$f":"IF(P6=\"\",\"\",V7-V6)","v":0},{"$f":"IF(P6=\"\",\"\",W7-W6)","v":-10},{"$f":"IF(P6=\"\",\"\",IF(P6=\"segmento\",SQRT(X6^2+Y6^2),R6*2*T6))","v":15.707963267948966},{"$f":"IF(P6=\"\",\"\",IF(P6=\"segmento\",(V6+V7)/2,AX6))","v":11.183098861837905},{"$f":"IF(P6=\"\",\"\",IF(P6=\"segmento\",(W6+W7)/2,AY6))","v":1},{"$f":"IF(P6=\"\",\"\",Z6*AB6)","v":15.707963267948966},{"$f":"IF(P6=\"\",\"\",Z6*AA6)","v":175.6637061435917},{"$f":"IF(P6=\"\",\"\",SQRT(X6^2+Y6^2))","v":10},{"$f":"ATAN(Y6/X6)","v":{"$error":"#DIV/0!"}},{"$f":"IF(AND(X6>0,Y6>0),AF6,\"\")","v":""},{"$f":"IF(AND(X6<0,Y6>0),AF6+PI(),\"\")","v":""},{"$f":"IF(AND(X6<0,Y6<0),AF6+PI(),\"\")","v":""},{"$f":"IF(AND(X6>0,Y6<0),AF6+2*PI(),\"\")","v":""},{"$f":"IF(AND(X6=0,Y6>0),PI()/2,\"\")","v":""},{"$f":"IF(AND(X6=0,Y6<0),1.5*PI(),\"\")","v":4.7123889803846897},{"$f":"IF(AND(X6>0,Y6=0),0,\"\")","v":""},{"$f":"IF(AND(X6<0,Y6=0),PI(),\"\")","v":""},{"$f":"IF(P6=\"\",\"\",MAXA(AG6:AN7))","v":4.7123889803846897},null,{"$f":"IF(OR(P6=\"\",P6=\"segmento\"),\"\",IF(S6=\"centro sx\",AO6+U6,2*PI()-(U6-AO6)))","v":10.995574287564276},{"$f":"IF(OR(P6=\"\",P6=\"segmento\"),\"\",IF(AQ6>2*PI(),AQ6-2*PI(),AQ6))","v":4.7123889803846897},{"$f":"IF(OR(P6=\"\",P6=\"segmento\"),\"\",V6+R6*COS(AR6))","v":7.9999999999999991},{"$f":"IF(OR(P6=\"\",P6=\"segmento\"),\"\",W6+R6*SIN(AR6))","v":1},{"$f":"IF(OR(P6=\"\",P6=\"segmento\"),\"\",R6*SIN(T6)/T6)","v":3.183098861837907},{"$f":"IF(OR(P6=\"\",P6=\"segmento\"),\"\",AR6+PI()+T6)","v":9.4247779607693793},{"$f":"IF(OR(P6=\"\",P6=\"segmento\"),\"\",BB6+T6)","v":3.1415926535897931},{"$f":"IF(OR(P6=\"\",P6=\"segmento\"),\"\",IF(S6=\"centro sx\",AS6+AU6*COS(BB6+T6*3/3),AS6+AU6*COS(BB6-T6*3/3)))","v":11.183098861837905},{"$f":"IF(OR(P6=\"\",P6=\"segmento\"),\"\",IF(S6=\"centro sx\",AT6+AU6*SIN(BB6+T6*3/3),AT6+AU6*SIN(BB6-T6*3/3)))","v":1},null,"x",{"$f":"IF(AR6-PI()<0,AR6+PI(),AR6-PI())","v":1.5707963267948966},{"$f":"IF(S6=\"centro sx\",AS6+R6*COS(BB6+T6*0/3),AS6+R6*COS(BB6-T6*0/3))","v":7.9999999999999991},{"$f":"IF($S$6=\"centro sx\",$AS$6+$R$6*COS($BB$6+$T6*1/3),$AS$6+$R$6*COS($BB$6-$T6*1/3))","v":10.499999999999998},{"$f":"IF($S$6=\"centro sx\",$AS$6+$R$6*COS($BB$6+$T6*2/3),$AS$6+$R$6*COS($BB$6-$T6*2/3))","v":12.330127018922191},{"$f":"IF($S$6=\"centro sx\",$AS$6+$R$6*COS($BB$6+$T6*3/3),$AS$6+$R$6*COS($BB$6-$T6*3/3))","v":13},{"$f":"IF($S$6=\"centro sx\",$AS$6+$R$6*COS($BB$6+$T6*4/3),$AS$6+$R$6*COS($BB$6-$T6*4/3))","v":12.330127018922193},{"$f":"IF($S$6=\"centro sx\",$AS$6+$R$6*COS($BB$6+$T6*5/3),$AS$6+$R$6*COS($BB$6-$T6*5/3))","v":10.499999999999998},{"$f":"IF($S$6=\"centro sx\",$AS$6+$R$6*COS($BB$6+$T6*6/3),$AS$6+$R$6*COS($BB$6-$T6*6/3))","v":7.9999999999999991},null,{"$f":"V6","v":8},{"$f":"BK6+AE6*1/6*COS(AO6)","v":8},{"$f":"BK6+AE6*2/6*COS(AO6)","v":7.9999999999999991},{"$f":"BK6+AE6*3/6*COS(AO6)","v":7.9999999999999991},{"$f":"BK6+AE6*4/6*COS(AO6)","v":7.9999999999999991},{"$f":"BK6+AE6*5/6*COS(AO6)","v":7.9999999999999982},{"$f":"BK6+AE6*6/6*COS(AO6)","v":7.9999999999999982},null,{"$f":"CONCATENATE(\"m\",O6,\" = √[(x\",Q7,\"-x\",Q6,\")²+(y\",Q7,\"-y\",Q6,,\")²] = √{[(\",FIXED(V7),\")-(\",,FIXED(V6),\")]²+[(\",,FIXED(W7),\")-(\",,FIXED(W6),\")]²} = \",FIXED(Z6),\" cm\")","v":"m2 = √[(xC-xB)²+(yC-yB)²] = √{[(8.00)-(8.00)]²+[(-4.00)-(6.00)]²} = 15.71 cm"},{"$f":"CONCATENATE(\"x\",O6,\" = (x\",Q7,\")+(x\",Q6,\")/2 = [(\",FIXED(W6),\")+(\",FIXED(V6),\")]/2 = \",FIXED(AA6),\" cm\")","v":"x2 = (xC)+(xB)/2 = [(6.00)+(8.00)]/2 = 11.18 cm"},{"$f":"CONCATENATE(\"y\",O6,\" = (y\",Q7,\"+y\",Q6,\")/2 = [(\",FIXED(W7),\")+(\",FIXED(W6),\")]/2 = \",FIXED(AB6),\" cm\")","v":"y2 = (yC+yB)/2 = [(-4.00)+(6.00)]/2 = 1.00 cm"},{"$f":"CONCATENATE(\"m\",O6,\" =  R∙2ω = \",FIXED(R6),\"x2x\",FIXED(T6,4),\" = \",FIXED(Z6),\" cm\")","v":"m2 =  R∙2ω = 5.00x2x1.5708 = 15.71 cm"},{"$f":"CONCATENATE(\"OG\",O6,\" =  R∙sen(α)/α(rad) = \",FIXED(R6),\"xsen(\",FIXED(T6,4),\"/\",FIXED(T6,4),\" = \",FIXED(AU6),\" cm\")","v":"OG2 =  R∙sen(α)/α(rad) = 5.00xsen(1.5708/1.5708 = 3.18 cm"},{"$f":"CONCATENATE(\"θ(OG) = \",FIXED(AW6,4),\" rad = \",FIXED(DEGREES(AW6),2),\"° deg\")","v":"θ(OG) = 3.1416 rad = 180.00° deg"},{"$f":"CONCATENATE(\"x\",O6,\" = XO + OG∙cos[θ(OG)] = \",FIXED(AS6),\"+\",FIXED(AU6),\"xcos(\",FIXED(DEGREES(AW6),4),\"°) = \",FIXED(AX6),\" cm\")","v":"x2 = XO + OG∙cos[θ(OG)] = 8.00+3.18xcos(180.0000°) = 11.18 cm"},{"$f":"CONCATENATE(\"y\",O6,\" = yO + OG∙sen[θ(OG)] = \",FIXED(AT6),\"+\",FIXED(AU6),\"xsen(\",FIXED(DEGREES(AW6),4),\"°) = \",FIXED(AY6),\" cm\")","v":"y2 = yO + OG∙sen[θ(OG)] = 1.00+3.18xsen(180.0000°) = 1.00 cm"},{"$f":"IF(P6=\"\",\"\",IF(P6=\"segmento\",BS6,BV6))","v":"m2 =  R∙2ω = 5.00x2x1.5708 = 15.71 cm"},{"$f":"IF(P6=\"\",\"\",IF(P6=\"segmento\",BT6,BY6))","v":"x2 = XO + OG∙cos[θ(OG)] = 8.00+3.18xcos(180.0000°) = 11.18 cm"},{"$f":"IF(P6=\"\",\"\",IF(P6=\"segmento\",BU6,BZ6))","v":"y2 = yO + OG∙sen[θ(OG)] = 1.00+3.18xsen(180.0000°) = 1.00 cm"},{"$f":"IF(OR(P6=\"\",P6=\"segmento\"),\"\",BW6)","v":"OG2 =  R∙sen(α)/α(rad) = 5.00xsen(1.5708/1.5708 = 3.18 cm"},{"$f":"IF(OR(P6=\"\",P6=\"segmento\"),\"\",BX6)","v":"θ(OG) = 3.1416 rad = 180.00° deg"},{"$f":"IF(P6=\"\",\"\",CONCATENATE(\"S\",O6,\"x = m\",O6,\"∙y\",O6,\" = \",FIXED(Z6),\"x(\",FIXED(AB6),\") = \",FIXED(AD6),\" cm²\"))","v":"S2x = m2∙y2 = 15.71x(1.00) = 175.66 cm²"},{"$f":"IF(P6=\"\",\"\",CONCATENATE(\"S\",O6,\"y = m\",O6,\"∙x\",O6,\" = \",FIXED(Z6),\"x(\",FIXED(AA6),\") = \",FIXED(AD6),\" cm²\"))","v":"S2y = m2∙x2 = 15.71x(11.18) = 175.66 cm²"}]
[null,null,null,null,null,null,null,null,null,null,null,null,null,null,null,null,"C",null,null,null,null,{"$f":"IF(Q7=\"\",\"\",LOOKUP(Q7,'01'!$B$2:$V$2,'01'!$B$3:$V$3))","v":8},{"$f":"IF(Q7=\"\",\"\",LOOKUP(Q7,'01'!$B$2:$V$2,'01'!$B$4:$V$4))","v":-4},null,null,null,null,null,null,null,null,null,null,null,null,null,{"$f":"IF(AND(X7=0,Y7>0),90,\"\")","v":""},{"$f":"IF(AND(X7=0,Y7<0),270,\"\")","v":""},"",{"$f":"IF(AND(X7<0,Y7=0),180,\"\")","v":""},{"$f":"MAXA(AF7:AM7)","v":0},null,null,null,null,null,null,null,null,{"$f":"IF($S$4=\"centro sx\",$AS$4+$R$4*COS($BB$4+$T7*3/3),$AS$4+$R$4*COS($BB$4-$T7*3/3))","v":{"$error":"#VALUE!"}},{"$f":"IF($S$4=\"centro sx\",$AT$4+$R$4*SIN($BB$4+$T$4*3/3),$AT$4+$R$4*SIN($BB$4-$T$4*3/3))","v":{"$error":"#VALUE!"}},null,"y",null,{"$f":"IF(S6=\"centro sx\",AT6+R6*SIN(BB6+T6*0/3),AT6+R6*SIN(BB6-T6*0/3))","v":6},{"$f":"IF($S$6=\"centro sx\",$AT$6+$R$6*SIN($BB$6+$T$6*1/3),$AT$6+$R$6*SIN($BB$6-$T$6*1/3))","v":5.3301270189221936},{"$f":"IF($S$6=\"centro sx\",$AT$6+$R$6*SIN($BB$6+$T$6*2/3),$AT$6+$R$6*SIN($BB$6-$T$6*2/3))","v":3.5},{"$f":"IF($S$6=\"centro sx\",$AT$6+$R$6*SIN($BB$6+$T$6*3/3),$AT$6+$R$6*SIN($BB$6-$T$6*3/3))","v":1},{"$f":"IF($S$6=\"centro sx\",$AT$6+$R$6*SIN($BB$6+$T$6*4/3),$AT$6+$R$6*SIN($BB$6-$T$6*4/3))","v":-1.4999999999999991},{"$f":"IF($S$6=\"centro sx\",$AT$6+$R$6*SIN($BB$6+$T$6*5/3),$AT$6+$R$6*SIN($BB$6-$T$6*5/3))","v":-3.3301270189221936},{"$f":"IF($S$6=\"centro sx\",$AT$6+$R$6*SIN($BB$6+$T$6*6/3),$AT$6+$R$6*SIN($BB$6-$T$6*6/3))","v":-4},null,{"$f":"W6","v":6},{"$f":"BK7+AE6*1/6*SIN(AO6)","v":4.333333333333333},{"$f":"BK7+AE6*2/6*SIN(AO6)","v":2.6666666666666665},{"$f":"BK7+AE6*3/6*SIN(AO6)","v":1},{"$f":"BK7+AE6*4/6*SIN(AO6)","v":-0.66666666666666696},{"$f":"BK7+AE6*5/6*SIN(AO6)","v":-2.3333333333333339},{"$f":"BK7+AE6*6/6*SIN(AO6)","v":-4}]
[null,null,null,null,null,null,null,null,null,null,null,null,null,null,"3","segmento","C",null,null,{"$f":"IF(OR(P8=\"\",P8=\"segmento\"),\"\",ASIN(0.5*AE8/R8))","v":""},{"$f":"IF(OR(P8=\"\",P8=\"segmento\"),\"\",PI()/2-T8)","v":""},{"$f":"IF(Q8=\"\",\"\",LOOKUP(Q8,'01'!$B$2:$V$2,'01'!$B$3:$V$3))","v":8},{"$f":"IF(Q8=\"\",\"\",LOOKUP(Q8,'01'!$B$2:$V$2,'01'!$B$4:$V$4))","v":-4},{"$f":"IF(P8=\"\",\"\",V9-V8)","v":-7},{"$f":"IF(P8=\"\",\"\",W9-W8)","v":0},{"$f":"IF(P8=\"\",\"\",IF(P8=\"segmento\",SQRT(X8^2+Y8^2),R8*2*T8))","v":7},{"$f":"IF(P8=\"\",\"\",IF(P8=\"segmento\",(V8+V9)/2,AX8))","v":4.5},{"$f":"IF(P8=\"\",\"\",IF(P8=\"segmento\",(W8+W9)/2,AY8))","v":-4},{"$f":"IF(P8=\"\",\"\",Z8*AB8)","v":-28},{"$f":"IF(P8=\"\",\"\",Z8*AA8)","v":31.5},{"$f":"IF(P8=\"\",\"\",SQRT(X8^2+Y8^2))","v":7},{"$f":"ATAN(Y8/X8)","v":0},{"$f":"IF(AND(X8>0,Y8>0),AF8,\"\")","v":""},{"$f":"IF(AND(X8<0,Y8>0),AF8+PI(),\"\")","v":""},{"$f":"IF(AND(X8<0,Y8<0),AF8+PI(),\"\")","v":""},{"$f":"IF(AND(X8>0,Y8<0),AF8+2*PI(),\"\")","v":""},{"$f":"IF(AND(X8=0,Y8>0),PI()/2,\"\")","v":""},{"$f":"IF(AND(X8=0,Y8<0),1.5*PI(),\"\")","v":""},"",{"$f":"IF(AND(X8<0,Y8=0),PI(),\"\")","v":3.1415926535897931},{"$f":"IF(P8=\"\",\"\",MAXA(AG8:AN9))","v":3.1415926535897931},null,{"$f":"IF(OR(P8=\"\",P8=\"segmento\"),\"\",IF(S8=\"centro sx\",AO8+U8,2*PI()-(U8-AO8)))","v":""},{"$f":"IF(OR(P8=\"\",P8=\"segmento\"),\"\",IF(AQ8>2*PI(),AQ8-2*PI(),AQ8))","v":""},{"$f":"IF(OR(P8=\"\",P8=\"segmento\"),\"\",V8+R8*COS(AR8))","v":""},{"$f":"IF(OR(P8=\"\",P8=\"segmento\"),\"\",W8+R8*SIN(AR8))","v":""},{"$f":"IF(OR(P8=\"\",P8=\"segmento\"),\"\",R8*SIN(T8)/T8)","v":""},{"$f":"IF(OR(P8=\"\",P8=\"segmento\"),\"\",AR8+PI()+T8)","v":""},{"$f":"IF(OR(P8=\"\",P8=\"segmento\"),\"\",BB8+T8)","v":""},{"$f":"IF(OR(P8=\"\",P8=\"segmento\"),\"\",IF(S8=\"centro sx\",AS8+AU8*COS(BB8+T8*3/3),AS8+AU8*COS(BB8-T8*3/3)))","v":""},{"$f":"IF(OR(P8=\"\",P8=\"segmento\"),\"\",IF(S8=\"centro sx\",AT8+AU8*SIN(BB8+T8*3/3),AT8+AU8*SIN(BB8-T8*3/3)))","v":""},null,"x",{"$f":"IF(AR8-PI()<0,AR8+PI(),AR8-PI())","v":{"$error":"#VALUE!"}},{"$f":"IF($S$8=\"centro sx\",$AS$8+$R$8*COS($BB$8+$T8*0/3),$AS$8+$R$8*COS($BB$8-$T8*0/3))","v":{"$error":"#VALUE!"}},{"$f":"IF($S$8=\"centro sx\",$AS$8+$R$8*COS($BB$8+$T8*1/3),$AS$8+$R$8*COS($BB$8-$T8*1/3))","v":{"$error":"#VALUE!"}},{"$f":"IF($S$8=\"centro sx\",$AS$8+$R$8*COS($BB$8+$T8*2/3),$AS$8+$R$8*COS($BB$8-$T8*2/3))","v":{"$error":"#VALUE!"}},{"$f":"IF($S$8=\"centro sx\",$AS$8+$R$8*COS($BB$8+$T8*3/3),$AS$8+$R$8*COS($BB$8-$T8*3/3))","v":{"$error":"#VALUE!"}},{"$f":"IF($S$8=\"centro sx\",$AS$8+$R$8*COS($BB$8+$T8*4/3),$AS$8+$R$8*COS($BB$8-$T8*4/3))","v":{"$error":"#VALUE!"}},{"$f":"IF($S$8=\"centro sx\",$AS$8+$R$8*COS($BB$8+$T8*5/3),$AS$8+$R$8*COS($BB$8-$T8*5/3))","v":{"$error":"#VALUE!"}},{"$f":"IF($S$8=\"centro sx\",$AS$8+$R$8*COS($BB$8+$T8*6/3),$AS$8+$R$8*COS($BB$8-$T8*6/3))","v":{"$error":"#VALUE!"}},null,{"$f":"V8","v":8},{"$f":"BK8+AE8*1/6*COS(AO8)","v":6.833333333333333},{"$f":"BK8+AE8*2/6*COS(AO8)","v":5.6666666666666661},{"$f":"BK8+AE8*3/6*COS(AO8)","v":4.5},{"$f":"BK8+AE8*4/6*COS(AO8)","v":3.333333333333333},{"$f":"BK8+AE8*5/6*COS(AO8)","v":2.166666666666667},{"$f":"BK8+AE8*6/6*COS(AO8)","v":1},null,{"$f":"CONCATENATE(\"m\",O8,\" = √[(x\",Q9,\"-x\",Q8,\")²+(y\",Q9,\"-y\",Q8,,\")²] = √{[(\",FIXED(V9),\")-(\",,FIXED(V8),\")]²+[(\",,FIXED(W9),\")-(\",,FIXED(W8),\")]²} = \",FIXED(Z8),\" cm\")","v":"m3 = √[(xD-xC)²+(yD-yC)²] = √{[(1.00)-(8.00)]²+[(-4.00)-(-4.00)]²} = 7.00 cm"},{"$f":"CONCATENATE(\"x\",O8,\" = (x\",Q9,\")+(x\",Q8,\")/2 = [(\",FIXED(W8),\")+(\",FIXED(V8),\")]/2 = \",FIXED(AA8),\" cm\")","v":"x3 = (xD)+(xC)/2 = [(-4.00)+(8.00)]/2 = 4.50 cm"},{"$f":"CONCATENATE(\"y\",O8,\" = (y\",Q9,\"+y\",Q8,\")/2 = [(\",FIXED(W9),\")+(\",FIXED(W8),\")]/2 = \",FIXED(AB8),\" cm\")","v":"y3 = (yD+yC)/2 = [(-4.00)+(-4.00)]/2 = -4.00 cm"},{"$f":"CONCATENATE(\"m\",O8,\" =  R∙2ω = \",FIXED(R8),\"x2x\",FIXED(T8,4),\" = \",FIXED(Z8),\" cm\")","v":{"$error":"#VALUE!"}},{"$f":"CONCATENATE(\"OG\",O8,\" =  R∙sen(α)/α(rad) = \",FIXED(R8),\"xsen(\",FIXED(T8,4),\"/\",FIXED(T8,4),\" = \",FIXED(AU8),\" cm\")","v":{"$error":"#VALUE!"}},{"$f":"CONCATENATE(\"θ(OG) = \",FIXED(AW8,4),\" rad = \",FIXED(DEGREES(AW8),2),\"° deg\")","v":{"$error":"#VALUE!"}},{"$f":"CONCATENATE(\"x\",O8,\" = XO + OG∙cos[θ(OG)] = \",FIXED(AS8),\"+\",FIXED(AU8),\"xcos(\",FIXED(DEGREES(AW8),4),\"°) = \",FIXED(AX8),\" cm\")","v":{"$error":"#VALUE!"}},{"$f":"CONCATENATE(\"y\",O8,\" = yO + OG∙sen[θ(OG)] = \",FIXED(AT8),\"+\",FIXED(AU8),\"xcos(\",FIXED(DEGREES(AW8),4),\"°) = \",FIXED(AY8),\" cm\")","v":{"$error":"#VALUE!"}},{"$f":"IF(P8=\"\",\"\",IF(P8=\"segmento\",BS8,BV8))","v":"m3 = √[(xD-xC)²+(yD-yC)²] = √{[(1.00)-(8.00)]²+[(-4.00)-(-4.00)]²} = 7.00 cm"},{"$f":"IF(P8=\"\",\"\",IF(P8=\"segmento\",BT8,BY8))","v":"x3 = (xD)+(xC)/2 = [(-4.00)+(8.00)]/2 = 4.50 cm"},{"$f":"IF(P8=\"\",\"\",IF(P8=\"segmento\",BU8,BZ8))","v":"y3 = (yD+yC)/2 = [(-4.00)+(-4.00)]/2 = -4.00 cm"},{"$f":"IF(OR(P8=\"\",P8=\"segmento\"),\"\",BW8)","v":""},{"$f":"IF(OR(P8=\"\",P8=\"segmento\"),\"\",BX8)","v":""},{"$f":"IF(P8=\"\",\"\",CONCATENATE(\"S\",O8,\"x = m\",O8,\"∙y\",O8,\" = \",FIXED(Z8),\"x(\",FIXED(AB8),\") = \",FIXED(AD8),\" cm²\"))","v":"S3x = m3∙y3 = 7.00x(-4.00) = 31.50 cm²"},{"$f":"IF(P8=\"\",\"\",CONCATENATE(\"S\",O8,\"y = m\",O8,\"∙x\",O8,\" = \",FIXED(Z8),\"x(\",FIXED(AA8),\") = \",FIXED(AD8),\" cm²\"))","v":"S3y = m3∙x3 = 7.00x(4.50) = 31.50 cm²"}]
[null,null,null,null,null,null,null,null,null,null,null,null,null,null,null,null,"D",null,null,null,null,{"$f":"IF(Q9=\"\",\"\",LOOKUP(Q9,'01'!$B$2:$V$2,'01'!$B$3:$V$3))","v":1},{"$f":"IF(Q9=\"\",\"\",LOOKUP(Q9,'01'!$B$2:$V$2,'01'!$B$4:$V$4))","v":-4},null,null,null,null,null,null,null,null,null,null,null,null,null,{"$f":"IF(AND(X9=0,Y9>0),90,\"\")","v":""},{"$f":"IF(AND(X9=0,Y9<0),270,\"\")","v":""},"",{"$f":"IF(AND(X9<0,Y9=0),180,\"\")","v":""},{"$f":"MAXA(AF9:AM9)","v":0},null,null,null,null,null,null,null,null,{"$f":"IF($S$4=\"centro sx\",$AS$4+$R$4*COS($BB$4+$T9*3/3),$AS$4+$R$4*COS($BB$4-$T9*3/3))","v":{"$error":"#VALUE!"}},{"$f":"IF($S$4=\"centro sx\",$AT$4+$R$4*SIN($BB$4+$T$4*3/3),$AT$4+$R$4*SIN($BB$4-$T$4*3/3))","v":{"$error":"#VALUE!"}},null,"y",null,{"$f":"IF($S$8=\"centro sx\",$AT$8+$R$8*SIN($BB$8+$T$8*0/3),$AT$8+$R$8*SIN($BB$8-$T$8*0/3))","v":{"$error":"#VALUE!"}},{"$f":"IF($S$8=\"centro sx\",$AT$8+$R$8*SIN($BB$8+$T$8*1/3),$AT$8+$R$8*SIN($BB$8-$T$8*1/3))","v":{"$error":"#VALUE!"}},{"$f":"IF($S$8=\"centro sx\",$AT$8+$R$8*SIN($BB$8+$T$8*2/3),$AT$8+$R$8*SIN($BB$8-$T$8*2/3))","v":{"$error":"#VALUE!"}},{"$f":"IF($S$8=\"centro sx\",$AT$8+$R$8*SIN($BB$8+$T$8*3/3),$AT$8+$R$8*SIN($BB$8-$T$8*3/3))","v":{"$error":"#VALUE!"}},{"$f":"IF($S$8=\"centro sx\",$AT$8+$R$8*SIN($BB$8+$T$8*4/3),$AT$8+$R$8*SIN($BB$8-$T$8*4/3))","v":{"$error":"#VALUE!"}},{"$f":"IF($S$8=\"centro sx\",$AT$8+$R$8*SIN($BB$8+$T$8*5/3),$AT$8+$R$8*SIN($BB$8-$T$8*5/3))","v":{"$error":"#VALUE!"}},{"$f":"IF($S$8=\"centro sx\",$AT$8+$R$8*SIN($BB$8+$T$8*6/3),$AT$8+$R$8*SIN($BB$8-$T$8*6/3))","v":{"$error":"#VALUE!"}},null,{"$f":"W8","v":-4},{"$f":"BK9+AE8*1/6*SIN(AO8)","v":-4},{"$f":"BK9+AE8*2/6*SIN(AO8)","v":-3.9999999999999996},{"$f":"BK9+AE8*3/6*SIN(AO8)","v":-3.9999999999999996},{"$f":"BK9+AE8*4/6*SIN(AO8)","v":-3.9999999999999996},{"$f":"BK9+AE8*5/6*SIN(AO8)","v":-3.9999999999999991},{"$f":"BK9+AE8*6/6*SIN(AO8)","v":-3.9999999999999991}]
[null,null,null,null,null,null,null,null,null,null,null,null,null,null,"4","segmento","D",null,null,{"$f":"IF(OR(P10=\"\",P10=\"segmento\"),\"\",ASIN(0.5*AE10/R10))","v":""},{"$f":"IF(OR(P10=\"\",P10=\"segmento\"),\"\",PI()/2-T10)","v":""},{"$f":"IF(Q10=\"\",\"\",LOOKUP(Q10,'01'!$B$2:$V$2,'01'!$B$3:$V$3))","v":1},{"$f":"IF(Q10=\"\",\"\",LOOKUP(Q10,'01'!$B$2:$V$2,'01'!$B$4:$V$4))","v":-4},-8,{"$f":"IF(P10=\"\",\"\",W11-W10)","v":-2},{"$f":"IF(P10=\"\",\"\",IF(P10=\"segmento\",SQRT(X10^2+Y10^2),R10*2*T10))","v":8.2462112512353212},{"$f":"IF(P10=\"\",\"\",IF(P10=\"segmento\",(V10+V11)/2,AX10))","v":-3},{"$f":"IF(P10=\"\",\"\",IF(P10=\"segmento\",(W10+W11)/2,AY10))","v":-5},{"$f":"IF(P10=\"\",\"\",Z10*AB10)","v":-41.231056256176608},{"$f":"IF(P10=\"\",\"\",Z10*AA10)","v":-24.738633753705962},{"$f":"IF(P10=\"\",\"\",SQRT(X10^2+Y10^2))","v":8.2462112512353212},{"$f":"ATAN(Y10/X10)","v":0.24497866312686414},{"$f":"IF(AND(X10>0,Y10>0),AF10,\"\")","v":""},{"$f":"IF(AND(X10<0,Y10>0),AF10+PI(),\"\")","v":""},{"$f":"IF(AND(X10<0,Y10<0),AF10+PI(),\"\")","v":3.3865713167166573},{"$f":"IF(AND(X10>0,Y10<0),AF10+2*PI(),\"\")","v":""},{"$f":"IF(AND(X10=0,Y10>0),PI()/2,\"\")","v":""},{"$f":"IF(AND(X10=0,Y10<0),1.5*PI(),\"\")","v":""},"",{"$f":"IF(AND(X10<0,Y10=0),PI(),\"\")","v":""},{"$f":"IF(P10=\"\",\"\",MAXA(AG10:AN11))","v":3.3865713167166573},null,{"$f":"IF(OR(P10=\"\",P10=\"segmento\"),\"\",IF(S10=\"centro sx\",AO10+U10,2*PI()-(U10-AO10)))","v":""},{"$f":"IF(OR(P10=\"\",P10=\"segmento\"),\"\",IF(AQ10>2*PI(),AQ10-2*PI(),AQ10))","v":""},{"$f":"IF(OR(P10=\"\",P10=\"segmento\"),\"\",V10+R10*COS(AR10))","v":""},{"$f":"IF(OR(P10=\"\",P10=\"segmento\"),\"\",W10+R10*SIN(AR10))","v":""},{"$f":"IF(OR(P10=\"\",P10=\"segmento\"),\"\",R10*SIN(T10)/T10)","v":""},{"$f":"IF(OR(P10=\"\",P10=\"segmento\"),\"\",AR10+PI()+T10)","v":""},{"$f":"IF(OR(P10=\"\",P10=\"segmento\"),\"\",BB10+T10)","v":""},{"$f":"IF(OR(P10=\"\",P10=\"segmento\"),\"\",IF(S10=\"centro sx\",AS10+AU10*COS(BB10+T10*3/3),AS10+AU10*COS(BB10-T10*3/3)))","v":""},{"$f":"IF(OR(P10=\"\",P10=\"segmento\"),\"\",IF(S10=\"centro sx\",AT10+AU10*SIN(BB10+T10*3/3),AT10+AU10*SIN(BB10-T10*3/3)))","v":""},null,"x",{"$f":"IF(AR10-PI()<0,AR10+PI(),AR10-PI())","v":{"$error":"#VALUE!"}},{"$f":"IF(S10=\"centro sx\",AS10+R10*COS(BB10+T10*0/3),$AS$10+$R$10*COS($BB$10-$T10*0/3))","v":{"$error":"#VALUE!"}},{"$f":"IF($S$10=\"centro sx\",$AS$10+$R$10*COS($BB$10+$T10*1/3),$AS$10+$R$10*COS($BB$10-$T10*1/3))","v":{"$error":"#VALUE!"}},{"$f":"IF($S$10=\"centro sx\",$AS$10+$R$10*COS($BB$10+$T10*2/3),$AS$10+$R$10*COS($BB$10-$T10*2/3))","v":{"$error":"#VALUE!"}},{"$f":"IF($S$10=\"centro sx\",$AS$10+$R$10*COS($BB$10+$T10*3/3),$AS$10+$R$10*COS($BB$10-$T10*3/3))","v":{"$error":"#VALUE!"}},{"$f":"IF($S$10=\"centro sx\",$AS$10+$R$10*COS($BB$10+$T10*4/3),$AS$10+$R$10*COS($BB$10-$T10*4/3))","v":{"$error":"#VALUE!"}},{"$f":"IF($S$10=\"centro sx\",$AS$10+$R$10*COS($BB$10+$T10*5/3),$AS$10+$R$10*COS($BB$10-$T10*5/3))","v":{"$error":"#VALUE!"}},{"$f":"IF($S$10=\"centro sx\",$AS$10+$R$10*COS($BB$10+$T10*6/3),$AS$10+$R$10*COS($BB$10-$T10*6/3))","v":{"$error":"#VALUE!"}},null,{"$f":"V10","v":1},{"$f":"BK10+AE10*1/6*COS(AO10)","v":-0.33333333333333326},{"$f":"BK10+AE10*2/6*COS(AO10)","v":-1.6666666666666665},{"$f":"BK10+AE10*3/6*COS(AO10)","v":-3},{"$f":"BK10+AE10*4/6*COS(AO10)","v":-4.333333333333333},{"$f":"BK10+AE10*5/6*COS(AO10)","v":-5.666666666666667},{"$f":"BK10+AE10*6/6*COS(AO10)","v":-7},null,{"$f":"CONCATENATE(\"m\",O10,\" = √[(x\",Q11,\"-x\",Q10,\")²+(y\",Q11,\"-y\",Q10,,\")²] = √{[(\",FIXED(V11),\")-(\",,FIXED(V10),\")]²+[(\",,FIXED(W11),\")-(\",,FIXED(W10),\")]²} = \",FIXED(Z10),\" cm\")","v":"m4 = √[(xE-xD)²+(yE-yD)²] = √{[(-7.00)-(1.00)]²+[(-6.00)-(-4.00)]²} = 8.25 cm"},{"$f":"CONCATENATE(\"x\",O10,\" = (x\",Q11,\")+(x\",Q10,\")/2 = [(\",FIXED(W10),\")+(\",FIXED(V10),\")]/2 = \",FIXED(AA10),\" cm\")","v":"x4 = (xE)+(xD)/2 = [(-4.00)+(1.00)]/2 = -3.00 cm"},{"$f":"CONCATENATE(\"y\",O10,\" = (y\",Q11,\"+y\",Q10,\")/2 = [(\",FIXED(W11),\")+(\",FIXED(W10),\")]/2 = \",FIXED(AB10),\" cm\")","v":"y4 = (yE+yD)/2 = [(-6.00)+(-4.00)]/2 = -5.00 cm"},{"$f":"CONCATENATE(\"m\",O10,\" =  R∙2ω = \",FIXED(R10),\"x2x\",FIXED(T10,4),\" = \",FIXED(Z10),\" cm\")","v":{"$error":"#VALUE!"}},{"$f":"CONCATENATE(\"OG\",O10,\" =  R∙sen(α)/α(rad) = \",FIXED(R10),\"xsen(\",FIXED(T10,4),\"/\",FIXED(T10,4),\" = \",FIXED(AU10),\" cm\")","v":{"$error":"#VALUE!"}},{"$f":"CONCATENATE(\"θ(OG) = \",FIXED(AW10,4),\" rad = \",FIXED(DEGREES(AW10),2),\"° deg\")","v":{"$error":"#VALUE!"}},{"$f":"CONCATENATE(\"x\",O10,\" = XO + OG∙cos[θ(OG)] = \",FIXED(AS10),\"+\",FIXED(AU10),\"xcos(\",FIXED(DEGREES(AW10),4),\"°) = \",FIXED(AX10),\" cm\")","v":{"$error":"#VALUE!"}},{"$f":"CONCATENATE(\"y\",O10,\" = yO + OG∙sen[θ(OG)] = \",FIXED(AT10),\"+\",FIXED(AU10),\"xcos(\",FIXED(DEGREES(AW10),4),\"°) = \",FIXED(AY10),\" cm\")","v":{"$error":"#VALUE!"}},{"$f":"IF(P10=\"\",\"\",IF(P10=\"segmento\",BS10,BV10))","v":"m4 = √[(xE-xD)²+(yE-yD)²] = √{[(-7.00)-(1.00)]²+[(-6.00)-(-4.00)]²} = 8.25 cm"},{"$f":"IF(P10=\"\",\"\",IF(P10=\"segmento\",BT10,BY10))","v":"x4 = (xE)+(xD)/2 = [(-4.00)+(1.00)]/2 = -3.00 cm"},{"$f":"IF(P10=\"\",\"\",IF(P10=\"segmento\",BU10,BZ10))","v":"y4 = (yE+yD)/2 = [(-6.00)+(-4.00)]/2 = -5.00 cm"},{"$f":"IF(OR(P10=\"\",P10=\"segmento\"),\"\",BW10)","v":""},{"$f":"IF(OR(P10=\"\",P10=\"segmento\"),\"\",BX10)","v":""},{"$f":"IF(P10=\"\",\"\",CONCATENATE(\"S\",O10,\"x = m\",O10,\"∙y\",O10,\" = \",FIXED(Z10),\"x(\",FIXED(AB10),\") = \",FIXED(AD10),\" cm²\"))","v":"S4x = m4∙y4 = 8.25x(-5.00) = -24.74 cm²"},{"$f":"IF(P10=\"\",\"\",CONCATENATE(\"S\",O10,\"y = m\",O10,\"∙x\",O10,\" = \",FIXED(Z10),\"x(\",FIXED(AA10),\") = \",FIXED(AD10),\" cm²\"))","v":"S4y = m4∙x4 = 8.25x(-3.00) = -24.74 cm²"}]
[null,null,null,null,null,null,null,null,null,null,null,null,null,null,null,null,"E",null,null,null,null,{"$f":"IF(Q11=\"\",\"\",LOOKUP(Q11,'01'!$B$2:$V$2,'01'!$B$3:$V$3))","v":-7},{"$f":"IF(Q11=\"\",\"\",LOOKUP(Q11,'01'!$B$2:$V$2,'01'!$B$4:$V$4))","v":-6},null,null,null,null,null,null,null,null,null,null,null,null,null,{"$f":"IF(AND(X11=0,Y11>0),90,\"\")","v":""},{"$f":"IF(AND(X11=0,Y11<0),270,\"\")","v":""},"",{"$f":"IF(AND(X11<0,Y11=0),180,\"\")","v":""},{"$f":"MAXA(AF11:AM11)","v":0},null,null,null,null,null,null,null,null,{"$f":"IF($S$4=\"centro sx\",$AS$4+$R$4*COS($BB$4+$T11*3/3),$AS$4+$R$4*COS($BB$4-$T11*3/3))","v":{"$error":"#VALUE!"}},{"$f":"IF($S$4=\"centro sx\",$AT$4+$R$4*SIN($BB$4+$T$4*3/3),$AT$4+$R$4*SIN($BB$4-$T$4*3/3))","v":{"$error":"#VALUE!"}},null,"y",null,{"$f":"IF($S$10=\"centro sx\",$AT$10+$R$10*SIN($BB$10+$T$10*0/3),$AT$10+$R$10*SIN($BB$10-$T$10*0/3))","v":{"$error":"#VALUE!"}},{"$f":"IF($S$10=\"centro sx\",$AT$10+$R$10*SIN($BB$10+$T$10*1/3),$AT$10+$R$10*SIN($BB$10-$T$10*1/3))","v":{"$error":"#VALUE!"}},{"$f":"IF($S$10=\"centro sx\",$AT$10+$R$10*SIN($BB$10+$T$10*2/3),$AT$10+$R$10*SIN($BB$10-$T$10*2/3))","v":{"$error":"#VALUE!"}},{"$f":"IF($S$10=\"centro sx\",$AT$10+$R$10*SIN($BB$10+$T$10*3/3),$AT$10+$R$10*SIN($BB$10-$T$10*3/3))","v":{"$error":"#VALUE!"}},{"$f":"IF($S$10=\"centro sx\",$AT$10+$R$10*SIN($BB$10+$T$10*4/3),$AT$10+$R$10*SIN($BB$10-$T$10*4/3))","v":{"$error":"#VALUE!"}},{"$f":"IF($S$10=\"centro sx\",$AT$10+$R$10*SIN($BB$10+$T$10*5/3),$AT$10+$R$10*SIN($BB$10-$T$10*5/3))","v":{"$error":"#VALUE!"}},{"$f":"IF($S$10=\"centro sx\",$AT$10+$R$10*SIN($BB$10+$T$10*6/3),$AT$10+$R$10*SIN($BB$10-$T$10*6/3))","v":{"$error":"#VALUE!"}},null,{"$f":"W10","v":-4},{"$f":"BK11+AE10*1/6*SIN(AO10)","v":-4.333333333333333},{"$f":"BK11+AE10*2/6*SIN(AO10)","v":-4.6666666666666661},{"$f":"BK11+AE10*3/6*SIN(AO10)","v":-5},{"$f":"BK11+AE10*4/6*SIN(AO10)","v":-5.333333333333333},{"$f":"BK11+AE10*5/6*SIN(AO10)","v":-5.6666666666666661},{"$f":"BK11+AE10*6/6*SIN(AO10)","v":-6}]
[null,null,null,null,null,null,null,null,null,null,null,null,null,null,"5","segmento","E",null,null,{"$f":"IF(OR(P12=\"\",P12=\"segmento\"),\"\",ASIN(0.5*AE12/R12))","v":""},{"$f":"IF(OR(P12=\"\",P12=\"segmento\"),\"\",PI()/2-T12)","v":""},{"$f":"IF(Q12=\"\",\"\",LOOKUP(Q12,'01'!$B$2:$V$2,'01'!$B$3:$V$3))","v":-7},{"$f":"IF(Q12=\"\",\"\",LOOKUP(Q12,'01'!$B$2:$V$2,'01'!$B$4:$V$4))","v":-6},{"$f":"IF(P12=\"\",\"\",V13-V12)","v":0},{"$f":"IF(P12=\"\",\"\",W13-W12)","v":7},{"$f":"IF(P12=\"\",\"\",IF(P12=\"segmento\",SQRT(X12^2+Y12^2),R12*2*T12))","v":7},{"$f":"IF(P12=\"\",\"\",IF(P12=\"segmento\",(V12+V13)/2,AX12))","v":-7},{"$f":"IF(P12=\"\",\"\",IF(P12=\"segmento\",(W12+W13)/2,AY12))","v":-2.5},{"$f":"IF(P12=\"\",\"\",Z12*AB12)","v":-17.5},{"$f":"IF(P12=\"\",\"\",Z12*AA12)","v":-49},{"$f":"IF(P12=\"\",\"\",SQRT(X12^2+Y12^2))","v":7},{"$f":"ATAN(Y12/X12)","v":{"$error":"#DIV/0!"}},{"$f":"IF(AND(X12>0,Y12>0),AF12,\"\")","v":""},{"$f":"IF(AND(X12<0,Y12>0),AF12+PI(),\"\")","v":""},{"$f":"IF(AND(X12<0,Y12<0),AF12+PI(),\"\")","v":""},{"$f":"IF(AND(X12>0,Y12<0),AF12+2*PI(),\"\")","v":""},{"$f":"IF(AND(X12=0,Y12>0),PI()/2,\"\")","v":1.5707963267948966},{"$f":"IF(AND(X12=0,Y12<0),1.5*PI(),\"\")","v":""},"",{"$f":"IF(AND(X12<0,Y12=0),PI(),\"\")","v":""},{"$f":"IF(P12=\"\",\"\",MAXA(AG12:AN13))","v":1.5707963267948966},null,{"$f":"IF(OR(P12=\"\",P12=\"segmento\"),\"\",IF(S12=\"centro sx\",AO12+U12,2*PI()-(U12-AO12)))","v":""},{"$f":"IF(OR(P12=\"\",P12=\"segmento\"),\"\",IF(AQ12>2*PI(),AQ12-2*PI(),AQ12))","v":""},{"$f":"IF(OR(P12=\"\",P12=\"segmento\"),\"\",V12+R12*COS(AR12))","v":""},{"$f":"IF(OR(P12=\"\",P12=\"segmento\"),\"\",W12+R12*SIN(AR12))","v":""},{"$f":"IF(OR(P12=\"\",P12=\"segmento\"),\"\",R12*SIN(T12)/T12)","v":""},{"$f":"IF(OR(P12=\"\",P12=\"segmento\"),\"\",AR12+PI()+T12)","v":""},{"$f":"IF(OR(P12=\"\",P12=\"segmento\"),\"\",BB12+T12)","v":""},{"$f":"IF(OR(P12=\"\",P12=\"segmento\"),\"\",IF(S12=\"centro sx\",AS12+AU12*COS(BB12+T12*3/3),AS12+AU12*COS(BB12-T12*3/3)))","v":""},{"$f":"IF(OR(P12=\"\",P12=\"segmento\"),\"\",IF(S12=\"centro sx\",AT12+AU12*SIN(BB12+T12*3/3),AT12+AU12*SIN(BB12-T12*3/3)))","v":""},null,"x",{"$f":"IF(AR12-PI()<0,AR12+PI(),AR12-PI())","v":{"$error":"#VALUE!"}},{"$f":"IF(S12=\"centro sx\",AS12+R12*COS(BB12+T12*0/3),$AS$12+$R$12*COS($BB$12-$T12*0/3))","v":{"$error":"#VALUE!"}},{"$f":"IF($S$12=\"centro sx\",$AS$12+$R$12*COS($BB$12+$T12*1/3),$AS$12+$R$12*COS($BB$12-$T12*1/3))","v":{"$error":"#VALUE!"}},{"$f":"IF($S$12=\"centro sx\",$AS$12+$R$12*COS($BB$12+$T12*2/3),$AS$12+$R$12*COS($BB$12-$T12*2/3))","v":{"$error":"#VALUE!"}},{"$f":"IF($S$12=\"centro sx\",$AS$12+$R$12*COS($BB$12+$T12*3/3),$AS$12+$R$12*COS($BB$12-$T12*3/3))","v":{"$error":"#VALUE!"}},{"$f":"IF($S$12=\"centro sx\",$AS$12+$R$12*COS($BB$12+$T12*4/3),$AS$12+$R$12*COS($BB$12-$T12*4/3))","v":{"$error":"#VALUE!"}},{"$f":"IF($S$12=\"centro sx\",$AS$12+$R$12*COS($BB$12+$T12*5/3),$AS$12+$R$12*COS($BB$12-$T12*5/3))","v":{"$error":"#VALUE!"}},{"$f":"IF($S$12=\"centro sx\",$AS$12+$R$12*COS($BB$12+$T12*6/3),$AS$12+$R$12*COS($BB$12-$T12*6/3))","v":{"$error":"#VALUE!"}},null,{"$f":"V12","v":-7},{"$f":"BK12+AE12*1/6*COS(AO12)","v":-7},{"$f":"BK12+AE12*2/6*COS(AO12)","v":-7},{"$f":"BK12+AE12*3/6*COS(AO12)","v":-7},{"$f":"BK12+AE12*4/6*COS(AO12)","v":-7},{"$f":"BK12+AE12*5/6*COS(AO12)","v":-7},{"$f":"BK12+AE12*6/6*COS(AO12)","v":-7},null,{"$f":"CONCATENATE(\"m\",O12,\" = √[(x\",Q13,\"-x\",Q12,\")²+(y\",Q13,\"-y\",Q12,,\")²] = √{[(\",FIXED(V13),\")-(\",,FIXED(V12),\")]²+[(\",,FIXED(W13),\")-(\",,FIXED(W12),\")]²} = \",FIXED(Z12),\" cm\")","v":"m5 = √[(xF-xE)²+(yF-yE)²] = √{[(-7.00)-(-7.00)]²+[(1.00)-(-6.00)]²} = 7.00 cm"},{"$f":"CONCATENATE(\"x\",O12,\" = (x\",Q13,\")+(x\",Q12,\")/2 = [(\",FIXED(W12),\")+(\",FIXED(V12),\")]/2 = \",FIXED(AA12),\" cm\")","v":"x5 = (xF)+(xE)/2 = [(-6.00)+(-7.00)]/2 = -7.00 cm"},{"$f":"CONCATENATE(\"y\",O12,\" = (y\",Q13,\"+y\",Q12,\")/2 = [(\",FIXED(W13),\")+(\",FIXED(W12),\")]/2 = \",FIXED(AB12),\" cm\")","v":"y5 = (yF+yE)/2 = [(1.00)+(-6.00)]/2 = -2.50 cm"},{"$f":"CONCATENATE(\"m\",O12,\" =  R∙2ω = \",FIXED(R12),\"x2x\",FIXED(T12,4),\" = \",FIXED(Z12),\" cm\")","v":{"$error":"#VALUE!"}},{"$f":"CONCATENATE(\"OG\",O12,\" =  R∙sen(α)/α(rad) = \",FIXED(R12),\"xsen(\",FIXED(T12,4),\"/\",FIXED(T12,4),\" = \",FIXED(AU12),\" cm\")","v":{"$error":"#VALUE!"}},{"$f":"CONCATENATE(\"θ(OG) = \",FIXED(AW12,4),\" rad = \",FIXED(DEGREES(AW12),2),\"° deg\")","v":{"$error":"#VALUE!"}},{"$f":"CONCATENATE(\"x\",O12,\" = XO + OG∙cos[θ(OG)] = \",FIXED(AS12),\"+\",FIXED(AU12),\"xcos(\",FIXED(DEGREES(AW12),4),\"°) = \",FIXED(AX12),\" cm\")","v":{"$error":"#VALUE!"}},{"$f":"CONCATENATE(\"y\",O12,\" = yO + OG∙sen[θ(OG)] = \",FIXED(AT12),\"+\",FIXED(AU12),\"xcos(\",FIXED(DEGREES(AW12),4),\"°) = \",FIXED(AY12),\" cm\")","v":{"$error":"#VALUE!"}},{"$f":"IF(P12=\"\",\"\",IF(P12=\"segmento\",BS12,BV12))","v":"m5 = √[(xF-xE)²+(yF-yE)²] = √{[(-7.00)-(-7.00)]²+[(1.00)-(-6.00)]²} = 7.00 cm"},{"$f":"IF(P12=\"\",\"\",IF(P12=\"segmento\",BT12,BY12))","v":"x5 = (xF)+(xE)/2 = [(-6.00)+(-7.00)]/2 = -7.00 cm"},{"$f":"IF(P12=\"\",\"\",IF(P12=\"segmento\",BU12,BZ12))","v":"y5 = (yF+yE)/2 = [(1.00)+(-6.00)]/2 = -2.50 cm"},{"$f":"IF(OR(P12=\"\",P12=\"segmento\"),\"\",BW12)","v":""},{"$f":"IF(OR(P12=\"\",P12=\"segmento\"),\"\",BX12)","v":""},{"$f":"IF(P12=\"\",\"\",CONCATENATE(\"S\",O12,\"x = m\",O12,\"∙y\",O12,\" = \",FIXED(Z12),\"x(\",FIXED(AB12),\") = \",FIXED(AD12),\" cm²\"))","v":"S5x = m5∙y5 = 7.00x(-2.50) = -49.00 cm²"},{"$f":"IF(P12=\"\",\"\",CONCATENATE(\"S\",O12,\"y = m\",O12,\"∙x\",O12,\" = \",FIXED(Z12),\"x(\",FIXED(AA12),\") = \",FIXED(AD12),\" cm²\"))","v":"S5y = m5∙x5 = 7.00x(-7.00) = -49.00 cm²"}]
[null,null,null,null,null,null,null,null,null,null,null,null,null,null,null,null,"F",null,null,null,null,{"$f":"IF(Q13=\"\",\"\",LOOKUP(Q13,'01'!$B$2:$V$2,'01'!$B$3:$V$3))","v":-7},{"$f":"IF(Q13=\"\",\"\",LOOKUP(Q13,'01'!$B$2:$V$2,'01'!$B$4:$V$4))","v":1},null,null,null,null,null,null,null,null,null,null,null,null,null,{"$f":"IF(AND(X13=0,Y13>0),90,\"\")","v":""},{"$f":"IF(AND(X13=0,Y13<0),270,\"\")","v":""},"",{"$f":"IF(AND(X13<0,Y13=0),180,\"\")","v":""},{"$f":"MAXA(AF13:AM13)","v":0},null,null,null,null,null,null,null,null,{"$f":"IF($S$4=\"centro sx\",$AS$4+$R$4*COS($BB$4+$T13*3/3),$AS$4+$R$4*COS($BB$4-$T13*3/3))","v":{"$error":"#VALUE!"}},{"$f":"IF($S$4=\"centro sx\",$AT$4+$R$4*SIN($BB$4+$T$4*3/3),$AT$4+$R$4*SIN($BB$4-$T$4*3/3))","v":{"$error":"#VALUE!"}},null,"y",null,{"$f":"IF($S$12=\"centro sx\",$AT$12+$R$12*SIN($BB$12+$T$12*0/3),$AT$12+$R$12*SIN($BB$12-$T$12*0/3))","v":{"$error":"#VALUE!"}},{"$f":"IF($S$12=\"centro sx\",$AT$12+$R$12*SIN($BB$12+$T$12*1/3),$AT$12+$R$12*SIN($BB$12-$T$12*1/3))","v":{"$error":"#VALUE!"}},{"$f":"IF($S$12=\"centro sx\",$AT$12+$R$12*SIN($BB$12+$T$12*2/3),$AT$12+$R$12*SIN($BB$12-$T$12*2/3))","v":{"$error":"#VALUE!"}},{"$f":"IF($S$12=\"centro sx\",$AT$12+$R$12*SIN($BB$12+$T$12*3/3),$AT$12+$R$12*SIN($BB$12-$T$12*3/3))","v":{"$error":"#VALUE!"}},{"$f":"IF($S$12=\"centro sx\",$AT$12+$R$12*SIN($BB$12+$T$12*4/3),$AT$12+$R$12*SIN($BB$12-$T$12*4/3))","v":{"$error":"#VALUE!"}},{"$f":"IF($S$12=\"centro sx\",$AT$12+$R$12*SIN($BB$12+$T$12*5/3),$AT$12+$R$12*SIN($BB$12-$T$12*5/3))","v":{"$error":"#VALUE!"}},{"$f":"IF($S$12=\"centro sx\",$AT$12+$R$12*SIN($BB$12+$T$12*6/3),$AT$12+$R$12*SIN($BB$12-$T$12*6/3))","v":{"$error":"#VALUE!"}},null,{"$f":"W12","v":-6},{"$f":"BK13+AE12*1/6*SIN(AO12)","v":-4.833333333333333},{"$f":"BK13+AE12*2/6*SIN(AO12)","v":-3.6666666666666665},{"$f":"BK13+AE12*3/6*SIN(AO12)","v":-2.5},{"$f":"BK13+AE12*4/6*SIN(AO12)","v":-1.333333333333333},{"$f":"BK13+AE12*5/6*SIN(AO12)","v":-0.16666666666666696},{"$f":"BK13+AE12*6/6*SIN(AO12)","v":1}]
[null,null,null,null,null,null,null,null,null,null,null,null,null,null,"6",null,null,null,null,{"$f":"IF(OR(P14=\"\",P14=\"segmento\"),\"\",ASIN(0.5*AE14/R14))","v":""},{"$f":"IF(OR(P14=\"\",P14=\"segmento\"),\"\",PI()/2-T14)","v":""},{"$f":"IF(Q14=\"\",\"\",LOOKUP(Q14,'01'!$B$2:$V$2,'01'!$B$3:$V$3))","v":""},{"$f":"IF(Q14=\"\",\"\",LOOKUP(Q14,'01'!$B$2:$V$2,'01'!$B$4:$V$4))","v":""},"",{"$f":"IF(P14=\"\",\"\",W15-W14)","v":""},{"$f":"IF(P14=\"\",\"\",IF(P14=\"segmento\",SQRT(X14^2+Y14^2),R14*2*T14))","v":""},{"$f":"IF(P14=\"\",\"\",IF(P14=\"segmento\",(V14+V15)/2,AX14))","v":""},{"$f":"IF(P14=\"\",\"\",IF(P14=\"segmento\",(W14+W15)/2,AY14))","v":""},{"$f":"IF(P14=\"\",\"\",Z14*AB14)","v":""},{"$f":"IF(P14=\"\",\"\",Z14*AA14)","v":""},{"$f":"IF(P14=\"\",\"\",SQRT(X14^2+Y14^2))","v":""},{"$f":"ATAN(Y14/X14)","v":{"$error":"#VALUE!"}},{"$f":"IF(AND(X14>0,Y14>0),AF14,\"\")","v":{"$error":"#VALUE!"}},{"$f":"IF(AND(X14<0,Y14>0),AF14+PI(),\"\")","v":""},{"$f":"IF(AND(X14<0,Y14<0),AF14+PI(),\"\")","v":""},{"$f":"IF(AND(X14>0,Y14<0),AF14+2*PI(),\"\")","v":""},{"$f":"IF(AND(X14=0,Y14>0),PI()/2,\"\")","v":""},{"$f":"IF(AND(X14=0,Y14<0),1.5*PI(),\"\")","v":""},"",{"$f":"IF(AND(X14<0,Y14=0),PI(),\"\")","v":""},{"$f":"IF(P14=\"\",\"\",MAXA(AG14:AN15))","v":""},null,{"$f":"IF(OR(P14=\"\",P14=\"segmento\"),\"\",IF(S14=\"centro sx\",AO14+U14,2*PI()-(U14-AO14)))","v":""},{"$f":"IF(OR(P14=\"\",P14=\"segmento\"),\"\",IF(AQ14>2*PI(),AQ14-2*PI(),AQ14))","v":""},{"$f":"IF(OR(P14=\"\",P14=\"segmento\"),\"\",V14+R14*COS(AR14))","v":""},{"$f":"IF(OR(P14=\"\",P14=\"segmento\"),\"\",W14+R14*SIN(AR14))","v":""},{"$f":"IF(OR(P14=\"\",P14=\"segmento\"),\"\",R14*SIN(T14)/T14)","v":""},{"$f":"IF(OR(P14=\"\",P14=\"segmento\"),\"\",AR14+PI()+T14)","v":""},{"$f":"IF(OR(P14=\"\",P14=\"segmento\"),\"\",BB14+T14)","v":""},{"$f":"IF(OR(P14=\"\",P14=\"segmento\"),\"\",IF(S14=\"centro sx\",AS14+AU14*COS(BB14+T14*3/3),AS14+AU14*COS(BB14-T14*3/3)))","v":""},{"$f":"IF(OR(P14=\"\",P14=\"segmento\"),\"\",IF(S14=\"centro sx\",AT14+AU14*SIN(BB14+T14*3/3),AT14+AU14*SIN(BB14-T14*3/3)))","v":""},null,"x",{"$f":"IF(AR14-PI()<0,AR14+PI(),AR14-PI())","v":{"$error":"#VALUE!"}},{"$f":"IF(S14=\"centro sx\",AS14+R14*COS(BB14+T14*0/3),$AS$14+$R$14*COS($BB$14-$T14*0/3))","v":{"$error":"#VALUE!"}},{"$f":"IF($S$14=\"centro sx\",$AS$14+$R$14*COS($BB$14+$T14*1/3),$AS$14+$R$14*COS($BB$14-$T14*1/3))","v":{"$error":"#VALUE!"}},{"$f":"IF($S$14=\"centro sx\",$AS$14+$R$14*COS($BB$14+$T14*2/3),$AS$14+$R$14*COS($BB$14-$T14*2/3))","v":{"$error":"#VALUE!"}},{"$f":"IF($S$14=\"centro sx\",$AS$14+$R$14*COS($BB$14+$T14*3/3),$AS$14+$R$14*COS($BB$14-$T14*3/3))","v":{"$error":"#VALUE!"}},{"$f":"IF($S$14=\"centro sx\",$AS$14+$R$14*COS($BB$14+$T14*4/3),$AS$14+$R$14*COS($BB$14-$T14*4/3))","v":{"$error":"#VALUE!"}},{"$f":"IF($S$14=\"centro sx\",$AS$14+$R$14*COS($BB$14+$T14*5/3),$AS$14+$R$14*COS($BB$14-$T14*5/3))","v":{"$error":"#VALUE!"}},{"$f":"IF($S$14=\"centro sx\",$AS$14+$R$14*COS($BB$14+$T14*6/3),$AS$14+$R$14*COS($BB$14-$T14*6/3))","v":{"$error":"#VALUE!"}},null,{"$f":"V14","v":""},{"$f":"BK14+AE14*1/6*COS(AO14)","v":{"$error":"#VALUE!"}},{"$f":"BK14+AE14*2/6*COS(AO14)","v":{"$error":"#VALUE!"}},{"$f":"BK14+AE14*3/6*COS(AO14)","v":{"$error":"#VALUE!"}},{"$f":"BK14+AE14*4/6*COS(AO14)","v":{"$error":"#VALUE!"}},{"$f":"BK14+AE14*5/6*COS(AO14)","v":{"$error":"#VALUE!"}},{"$f":"BK14+AE14*6/6*COS(AO14)","v":{"$error":"#VALUE!"}},null,{"$f":"CONCATENATE(\"m\",O14,\" = √[(x\",Q15,\"-x\",Q14,\")²+(y\",Q15,\"-y\",Q14,,\")²] = √{[(\",FIXED(V15),\")-(\",,FIXED(V14),\")]²+[(\",,FIXED(W15),\")-(\",,FIXED(W14),\")]²} = \",FIXED(Z14),\" cm\")","v":{"$error":"#VALUE!"}},{"$f":"CONCATENATE(\"x\",O14,\" = (x\",Q15,\")+(x\",Q14,\")/2 = [(\",FIXED(W14),\")+(\",FIXED(V14),\")]/2 = \",FIXED(AA14),\" cm\")","v":{"$error":"#VALUE!"}},{"$f":"CONCATENATE(\"y\",O14,\" = (y\",Q15,\"+y\",Q14,\")/2 = [(\",FIXED(W15),\")+(\",FIXED(W14),\")]/2 = \",FIXED(AB14),\" cm\")","v":{"$error":"#VALUE!"}},{"$f":"CONCATENATE(\"m\",O14,\" =  R∙2ω = \",FIXED(R14),\"x2x\",FIXED(T14,4),\" = \",FIXED(Z14),\" cm\")","v":{"$error":"#VALUE!"}},{"$f":"CONCATENATE(\"OG\",O14,\" =  R∙sen(α)/α(rad) = \",FIXED(R14),\"xsen(\",FIXED(T14,4),\"/\",FIXED(T14,4),\" = \",FIXED(AU14),\" cm\")","v":{"$error":"#VALUE!"}},{"$f":"CONCATENATE(\"θ(OG) = \",FIXED(AW14,4),\" rad = \",FIXED(DEGREES(AW14),2),\"° deg\")","v":{"$error":"#VALUE!"}},{"$f":"CONCATENATE(\"x\",O14,\" = XO + OG∙cos[θ(OG)] = \",FIXED(AS14),\"+\",FIXED(AU14),\"xcos(\",FIXED(DEGREES(AW14),4),\"°) = \",FIXED(AX14),\" cm\")","v":{"$error":"#VALUE!"}},{"$f":"CONCATENATE(\"y\",O14,\" = yO + OG∙sen[θ(OG)] = \",FIXED(AT14),\"+\",FIXED(AU14),\"xcos(\",FIXED(DEGREES(AW14),4),\"°) = \",FIXED(AY14),\" cm\")","v":{"$error":"#VALUE!"}},{"$f":"IF(P14=\"\",\"\",IF(P14=\"segmento\",BS14,BV14))","v":""},{"$f":"IF(P14=\"\",\"\",IF(P14=\"segmento\",BT14,BY14))","v":""},{"$f":"IF(P14=\"\",\"\",IF(P14=\"segmento\",BU14,BZ14))","v":""},{"$f":"IF(OR(P14=\"\",P14=\"segmento\"),\"\",BW14)","v":""},{"$f":"IF(OR(P14=\"\",P14=\"segmento\"),\"\",BX14)","v":""},{"$f":"IF(P14=\"\",\"\",CONCATENATE(\"S\",O14,\"x = m\",O14,\"∙y\",O14,\" = \",FIXED(Z14),\"x(\",FIXED(AB14),\") = \",FIXED(AD14),\" cm²\"))","v":""},{"$f":"IF(P14=\"\",\"\",CONCATENATE(\"S\",O14,\"y = m\",O14,\"∙x\",O14,\" = \",FIXED(Z14),\"x(\",FIXED(AA14),\") = \",FIXED(AD14),\" cm²\"))","v":""}]
[null,null,null,null,null,null,null,null,null,null,null,null,null,null,null,null,null,null,null,null,null,{"$f":"IF(Q15=\"\",\"\",LOOKUP(Q15,'01'!$B$2:$V$2,'01'!$B$3:$V$3))","v":""},{"$f":"IF(Q15=\"\",\"\",LOOKUP(Q15,'01'!$B$2:$V$2,'01'!$B$4:$V$4))","v":""},null,null,null,null,null,null,null,null,null,null,null,null,null,{"$f":"IF(AND(X15=0,Y15>0),90,\"\")","v":""},{"$f":"IF(AND(X15=0,Y15<0),270,\"\")","v":""},"",{"$f":"IF(AND(X15<0,Y15=0),180,\"\")","v":""},{"$f":"MAXA(AF15:AM15)","v":0},null,null,null,null,null,null,null,null,{"$f":"IF($S$4=\"centro sx\",$AS$4+$R$4*COS($BB$4+$T15*3/3),$AS$4+$R$4*COS($BB$4-$T15*3/3))","v":{"$error":"#VALUE!"}},{"$f":"IF($S$4=\"centro sx\",$AT$4+$R$4*SIN($BB$4+$T$4*3/3),$AT$4+$R$4*SIN($BB$4-$T$4*3/3))","v":{"$error":"#VALUE!"}},null,"y",null,{"$f":"IF($S$14=\"centro sx\",$AT$14+$R$14*SIN($BB$14+$T$14*0/3),$AT$14+$R$14*SIN($BB$14-$T$14*0/3))","v":{"$error":"#VALUE!"}},{"$f":"IF($S$14=\"centro sx\",$AT$14+$R$14*SIN($BB$14+$T$14*1/3),$AT$14+$R$14*SIN($BB$14-$T$14*1/3))","v":{"$error":"#VALUE!"}},{"$f":"IF($S$14=\"centro sx\",$AT$14+$R$14*SIN($BB$14+$T$14*2/3),$AT$14+$R$14*SIN($BB$14-$T$14*2/3))","v":{"$error":"#VALUE!"}},{"$f":"IF($S$14=\"centro sx\",$AT$14+$R$14*SIN($BB$14+$T$14*3/3),$AT$14+$R$14*SIN($BB$14-$T$14*3/3))","v":{"$error":"#VALUE!"}},{"$f":"IF($S$14=\"centro sx\",$AT$14+$R$14*SIN($BB$14+$T$14*4/3),$AT$14+$R$14*SIN($BB$14-$T$14*4/3))","v":{"$error":"#VALUE!"}},{"$f":"IF($S$14=\"centro sx\",$AT$14+$R$14*SIN($BB$14+$T$14*5/3),$AT$14+$R$14*SIN($BB$14-$T$14*5/3))","v":{"$error":"#VALUE!"}},{"$f":"IF($S$14=\"centro sx\",$AT$14+$R$14*SIN($BB$14+$T$14*6/3),$AT$14+$R$14*SIN($BB$14-$T$14*6/3))","v":{"$error":"#VALUE!"}},null,{"$f":"W14","v":""},{"$f":"BK15+AE14*1/6*SIN(AO14)","v":{"$error":"#VALUE!"}},{"$f":"BK15+AE14*2/6*SIN(AO14)","v":{"$error":"#VALUE!"}},{"$f":"BK15+AE14*3/6*SIN(AO14)","v":{"$error":"#VALUE!"}},{"$f":"BK15+AE14*4/6*SIN(AO14)","v":{"$error":"#VALUE!"}},{"$f":"BK15+AE14*5/6*SIN(AO14)","v":{"$error":"#VALUE!"}},{"$f":"BK15+AE14*6/6*SIN(AO14)","v":{"$error":"#VALUE!"}}]
[null,null,null,null,null,null,null,null,null,null,null,null,null,null,"7",null,null,null,null,{"$f":"IF(OR(P16=\"\",P16=\"segmento\"),\"\",ASIN(0.5*AE16/R16))","v":""},{"$f":"IF(OR(P16=\"\",P16=\"segmento\"),\"\",PI()/2-T16)","v":""},{"$f":"IF(Q16=\"\",\"\",LOOKUP(Q16,'01'!$B$2:$V$2,'01'!$B$3:$V$3))","v":""},{"$f":"IF(Q16=\"\",\"\",LOOKUP(Q16,'01'!$B$2:$V$2,'01'!$B$4:$V$4))","v":""},"",{"$f":"IF(P16=\"\",\"\",W17-W16)","v":""},{"$f":"IF(P16=\"\",\"\",IF(P16=\"segmento\",SQRT(X16^2+Y16^2),R16*2*T16))","v":""},{"$f":"IF(P16=\"\",\"\",IF(P16=\"segmento\",(V16+V17)/2,AX16))","v":""},{"$f":"IF(P16=\"\",\"\",IF(P16=\"segmento\",(W16+W17)/2,AY16))","v":""},{"$f":"IF(P16=\"\",\"\",Z16*AB16)","v":""},{"$f":"IF(P16=\"\",\"\",Z16*AA16)","v":""},{"$f":"IF(P16=\"\",\"\",SQRT(X16^2+Y16^2))","v":""},{"$f":"ATAN(Y16/X16)","v":{"$error":"#VALUE!"}},{"$f":"IF(AND(X16>0,Y16>0),AF16,\"\")","v":{"$error":"#VALUE!"}},{"$f":"IF(AND(X16<0,Y16>0),AF16+PI(),\"\")","v":""},{"$f":"IF(AND(X16<0,Y16<0),AF16+PI(),\"\")","v":""},{"$f":"IF(AND(X16>0,Y16<0),AF16+2*PI(),\"\")","v":""},{"$f":"IF(AND(X16=0,Y16>0),PI()/2,\"\")","v":""},{"$f":"IF(AND(X16=0,Y16<0),1.5*PI(),\"\")","v":""},"",{"$f":"IF(AND(X16<0,Y16=0),PI(),\"\")","v":""},{"$f":"IF(P16=\"\",\"\",MAXA(AG16:AN17))","v":""},null,{"$f":"IF(OR(P16=\"\",P16=\"segmento\"),\"\",IF(S16=\"centro sx\",AO16+U16,2*PI()-(U16-AO16)))","v":""},{"$f":"IF(OR(P16=\"\",P16=\"segmento\"),\"\",IF(AQ16>2*PI(),AQ16-2*PI(),AQ16))","v":""},{"$f":"IF(OR(P16=\"\",P16=\"segmento\"),\"\",V16+R16*COS(AR16))","v":""},{"$f":"IF(OR(P16=\"\",P16=\"segmento\"),\"\",W16+R16*SIN(AR16))","v":""},{"$f":"IF(OR(P16=\"\",P16=\"segmento\"),\"\",R16*SIN(T16)/T16)","v":""},{"$f":"IF(OR(P16=\"\",P16=\"segmento\"),\"\",AR16+PI()+T16)","v":""},{"$f":"IF(OR(P16=\"\",P16=\"segmento\"),\"\",BB16+T16)","v":""},{"$f":"IF(OR(P16=\"\",P16=\"segmento\"),\"\",IF(S16=\"centro sx\",AS16+AU16*COS(BB16+T16*3/3),AS16+AU16*COS(BB16-T16*3/3)))","v":""},{"$f":"IF(OR(P16=\"\",P16=\"segmento\"),\"\",IF(S16=\"centro sx\",AT16+AU16*SIN(BB16+T16*3/3),AT16+AU16*SIN(BB16-T16*3/3)))","v":""},null,"x",{"$f":"IF(AR16-PI()<0,AR16+PI(),AR16-PI())","v":{"$error":"#VALUE!"}},{"$f":"IF(S16=\"centro sx\",AS16+R16*COS(BB16+T16*0/3),$AS$16+$R$16*COS($BB$16-$T16*0/3))","v":{"$error":"#VALUE!"}},{"$f":"IF($S$16=\"centro sx\",$AS$16+$R$16*COS($BB$16+$T16*1/3),$AS$16+$R$16*COS($BB$16-$T16*1/3))","v":{"$error":"#VALUE!"}},{"$f":"IF($S$16=\"centro sx\",$AS$16+$R$16*COS($BB$16+$T16*2/3),$AS$16+$R$16*COS($BB$16-$T16*2/3))","v":{"$error":"#VALUE!"}},{"$f":"IF($S$16=\"centro sx\",$AS$16+$R$16*COS($BB$16+$T16*3/3),$AS$16+$R$16*COS($BB$16-$T16*3/3))","v":{"$error":"#VALUE!"}},{"$f":"IF($S$16=\"centro sx\",$AS$16+$R$16*COS($BB$16+$T16*4/3),$AS$16+$R$16*COS($BB$16-$T16*4/3))","v":{"$error":"#VALUE!"}},{"$f":"IF($S$16=\"centro sx\",$AS$16+$R$16*COS($BB$16+$T16*5/3),$AS$16+$R$16*COS($BB$16-$T16*5/3))","v":{"$error":"#VALUE!"}},{"$f":"IF($S$16=\"centro sx\",$AS$16+$R$16*COS($BB$16+$T16*6/3),$AS$16+$R$16*COS($BB$16-$T16*6/3))","v":{"$error":"#VALUE!"}},null,{"$f":"V16","v":""},{"$f":"BK16+AE16*1/6*COS(AO16)","v":{"$error":"#VALUE!"}},{"$f":"BK16+AE16*2/6*COS(AO16)","v":{"$error":"#VALUE!"}},{"$f":"BK16+AE16*3/6*COS(AO16)","v":{"$error":"#VALUE!"}},{"$f":"BK16+AE16*4/6*COS(AO16)","v":{"$error":"#VALUE!"}},{"$f":"BK16+AE16*5/6*COS(AO16)","v":{"$error":"#VALUE!"}},{"$f":"BK16+AE16*6/6*COS(AO16)","v":{"$error":"#VALUE!"}},null,{"$f":"CONCATENATE(\"m\",O16,\" = √[(x\",Q17,\"-x\",Q16,\")²+(y\",Q17,\"-y\",Q16,,\")²] = √{[(\",FIXED(V17),\")-(\",,FIXED(V16),\")]²+[(\",,FIXED(W17),\")-(\",,FIXED(W16),\")]²} = \",FIXED(Z16),\" cm\")","v":{"$error":"#VALUE!"}},{"$f":"CONCATENATE(\"x\",O16,\" = (x\",Q17,\")+(x\",Q16,\")/2 = [(\",FIXED(W16),\")+(\",FIXED(V16),\")]/2 = \",FIXED(AA16),\" cm\")","v":{"$error":"#VALUE!"}},{"$f":"CONCATENATE(\"y\",O16,\" = (y\",Q17,\"+y\",Q16,\")/2 = [(\",FIXED(W17),\")+(\",FIXED(W16),\")]/2 = \",FIXED(AB16),\" cm\")","v":{"$error":"#VALUE!"}},{"$f":"CONCATENATE(\"m\",O16,\" =  R∙2ω = \",FIXED(R16),\"x2x\",FIXED(T16,4),\" = \",FIXED(Z16),\" cm\")","v":{"$error":"#VALUE!"}},{"$f":"CONCATENATE(\"OG\",O16,\" =  R∙sen(α)/α(rad) = \",FIXED(R16),\"xsen(\",FIXED(T16,4),\"/\",FIXED(T16,4),\" = \",FIXED(AU16),\" cm\")","v":{"$error":"#VALUE!"}},{"$f":"CONCATENATE(\"θ(OG) = \",FIXED(AW16,4),\" rad = \",FIXED(DEGREES(AW16),2),\"° deg\")","v":{"$error":"#VALUE!"}},{"$f":"CONCATENATE(\"x\",O16,\" = XO + OG∙cos[θ(OG)] = \",FIXED(AS16),\"+\",FIXED(AU16),\"xcos(\",FIXED(DEGREES(AW16),4),\"°) = \",FIXED(AX16),\" cm\")","v":{"$error":"#VALUE!"}},{"$f":"CONCATENATE(\"y\",O16,\" = yO + OG∙sen[θ(OG)] = \",FIXED(AT16),\"+\",FIXED(AU16),\"xcos(\",FIXED(DEGREES(AW16),4),\"°) = \",FIXED(AY16),\" cm\")","v":{"$error":"#VALUE!"}},{"$f":"IF(P16=\"\",\"\",IF(P16=\"segmento\",BS16,BV16))","v":""},{"$f":"IF(P16=\"\",\"\",IF(P16=\"segmento\",BT16,BY16))","v":""},{"$f":"IF(P16=\"\",\"\",IF(P16=\"segmento\",BU16,BZ16))","v":""},{"$f":"IF(OR(P16=\"\",P16=\"segmento\"),\"\",BW16)","v":""},{"$f":"IF(OR(P16=\"\",P16=\"segmento\"),\"\",BX16)","v":""},{"$f":"IF(P16=\"\",\"\",CONCATENATE(\"S\",O16,\"x = m\",O16,\"∙y\",O16,\" = \",FIXED(Z16),\"x(\",FIXED(AB16),\") = \",FIXED(AD16),\" cm²\"))","v":""},{"$f":"IF(P16=\"\",\"\",CONCATENATE(\"S\",O16,\"y = m\",O16,\"∙x\",O16,\" = \",FIXED(Z16),\"x(\",FIXED(AA16),\") = \",FIXED(AD16),\" cm²\"))","v":""}]
[null,null,null,null,null,null,null,null,null,null,null,null,null,null,null,null,null,null,null,null,null,{"$f":"IF(Q17=\"\",\"\",LOOKUP(Q17,'01'!$B$2:$V$2,'01'!$B$3:$V$3))","v":""},{"$f":"IF(Q17=\"\",\"\",LOOKUP(Q17,'01'!$B$2:$V$2,'01'!$B$4:$V$4))","v":""},null,null,null,null,null,null,null,null,null,null,null,null,null,{"$f":"IF(AND(X17=0,Y17>0),90,\"\")","v":""},{"$f":"IF(AND(X17=0,Y17<0),270,\"\")","v":""},"",{"$f":"IF(AND(X17<0,Y17=0),180,\"\")","v":""},{"$f":"MAXA(AF17:AM17)","v":0},null,null,null,null,null,null,null,null,{"$f":"IF($S$4=\"centro sx\",$AS$4+$R$4*COS($BB$4+$T17*3/3),$AS$4+$R$4*COS($BB$4-$T17*3/3))","v":{"$error":"#VALUE!"}},{"$f":"IF($S$4=\"centro sx\",$AT$4+$R$4*SIN($BB$4+$T$4*3/3),$AT$4+$R$4*SIN($BB$4-$T$4*3/3))","v":{"$error":"#VALUE!"}},null,"y",null,{"$f":"IF($S$16=\"centro sx\",$AT$16+$R$16*SIN($BB$16+$T$16*0/3),$AT$16+$R$16*SIN($BB$16-$T$16*0/3))","v":{"$error":"#VALUE!"}},{"$f":"IF($S$16=\"centro sx\",$AT$16+$R$16*SIN($BB$16+$T$16*1/3),$AT$16+$R$16*SIN($BB$16-$T$16*1/3))","v":{"$error":"#VALUE!"}},{"$f":"IF($S$16=\"centro sx\",$AT$16+$R$16*SIN($BB$16+$T$16*2/3),$AT$16+$R$16*SIN($BB$16-$T$16*2/3))","v":{"$error":"#VALUE!"}},{"$f":"IF($S$16=\"centro sx\",$AT$16+$R$16*SIN($BB$16+$T$16*3/3),$AT$16+$R$16*SIN($BB$16-$T$16*3/3))","v":{"$error":"#VALUE!"}},{"$f":"IF($S$16=\"centro sx\",$AT$16+$R$16*SIN($BB$16+$T$16*4/3),$AT$16+$R$16*SIN($BB$16-$T$16*4/3))","v":{"$error":"#VALUE!"}},{"$f":"IF($S$16=\"centro sx\",$AT$16+$R$16*SIN($BB$16+$T$16*5/3),$AT$16+$R$16*SIN($BB$16-$T$16*5/3))","v":{"$error":"#VALUE!"}},{"$f":"IF($S$16=\"centro sx\",$AT$16+$R$16*SIN($BB$16+$T$16*6/3),$AT$16+$R$16*SIN($BB$16-$T$16*6/3))","v":{"$error":"#VALUE!"}},null,{"$f":"W16","v":""},{"$f":"BK17+AE16*1/6*SIN(AO16)","v":{"$error":"#VALUE!"}},{"$f":"BK17+AE16*2/6*SIN(AO16)","v":{"$error":"#VALUE!"}},{"$f":"BK17+AE16*3/6*SIN(AO16)","v":{"$error":"#VALUE!"}},{"$f":"BK17+AE16*4/6*SIN(AO16)","v":{"$error":"#VALUE!"}},{"$f":"BK17+AE16*5/6*SIN(AO16)","v":{"$error":"#VALUE!"}},{"$f":"BK17+AE16*6/6*SIN(AO16)","v":{"$error":"#VALUE!"}}]
[null,null,null,null,null,null,null,null,null,null,null,null,null,null,"8",null,null,null,null,{"$f":"IF(OR(P18=\"\",P18=\"segmento\"),\"\",ASIN(0.5*AE18/R18))","v":""},{"$f":"IF(OR(P18=\"\",P18=\"segmento\"),\"\",PI()/2-T18)","v":""},{"$f":"IF(Q18=\"\",\"\",LOOKUP(Q18,'01'!$B$2:$V$2,'01'!$B$3:$V$3))","v":""},{"$f":"IF(Q18=\"\",\"\",LOOKUP(Q18,'01'!$B$2:$V$2,'01'!$B$4:$V$4))","v":""},"",{"$f":"IF(P18=\"\",\"\",W19-W18)","v":""},{"$f":"IF(P18=\"\",\"\",IF(P18=\"segmento\",SQRT(X18^2+Y18^2),R18*2*T18))","v":""},{"$f":"IF(P18=\"\",\"\",IF(P18=\"segmento\",(V18+V19)/2,AX18))","v":""},{"$f":"IF(P18=\"\",\"\",IF(P18=\"segmento\",(W18+W19)/2,AY18))","v":""},{"$f":"IF(P18=\"\",\"\",Z18*AB18)","v":""},{"$f":"IF(P18=\"\",\"\",Z18*AA18)","v":""},{"$f":"IF(P18=\"\",\"\",SQRT(X18^2+Y18^2))","v":""},{"$f":"ATAN(Y18/X18)","v":{"$error":"#VALUE!"}},{"$f":"IF(AND(X18>0,Y18>0),AF18,\"\")","v":{"$error":"#VALUE!"}},{"$f":"IF(AND(X18<0,Y18>0),AF18+PI(),\"\")","v":""},{"$f":"IF(AND(X18<0,Y18<0),AF18+PI(),\"\")","v":""},{"$f":"IF(AND(X18>0,Y18<0),AF18+2*PI(),\"\")","v":""},{"$f":"IF(AND(X18=0,Y18>0),PI()/2,\"\")","v":""},{"$f":"IF(AND(X18=0,Y18<0),1.5*PI(),\"\")","v":""},"",{"$f":"IF(AND(X18<0,Y18=0),PI(),\"\")","v":""},{"$f":"IF(P18=\"\",\"\",MAXA(AG18:AN19))","v":""},null,{"$f":"IF(OR(P18=\"\",P18=\"segmento\"),\"\",IF(S18=\"centro sx\",AO18+U18,2*PI()-(U18-AO18)))","v":""},{"$f":"IF(OR(P18=\"\",P18=\"segmento\"),\"\",IF(AQ18>2*PI(),AQ18-2*PI(),AQ18))","v":""},{"$f":"IF(OR(P18=\"\",P18=\"segmento\"),\"\",V18+R18*COS(AR18))","v":""},{"$f":"IF(OR(P18=\"\",P18=\"segmento\"),\"\",W18+R18*SIN(AR18))","v":""},{"$f":"IF(OR(P18=\"\",P18=\"segmento\"),\"\",R18*SIN(T18)/T18)","v":""},{"$f":"IF(OR(P18=\"\",P18=\"segmento\"),\"\",AR18+PI()+T18)","v":""},{"$f":"IF(OR(P18=\"\",P18=\"segmento\"),\"\",BB18+T18)","v":""},{"$f":"IF(OR(P18=\"\",P18=\"segmento\"),\"\",IF(S18=\"centro sx\",AS18+AU18*COS(BB18+T18*3/3),AS18+AU18*COS(BB18-T18*3/3)))","v":""},{"$f":"IF(OR(P18=\"\",P18=\"segmento\"),\"\",IF(S18=\"centro sx\",AT18+AU18*SIN(BB18+T18*3/3),AT18+AU18*SIN(BB18-T18*3/3)))","v":""},null,"x",{"$f":"IF(AR18-PI()<0,AR18+PI(),AR18-PI())","v":{"$error":"#VALUE!"}},{"$f":"IF(S18=\"centro sx\",AS18+R18*COS(BB18+T18*0/3),$AS$18+$R$18*COS($BB$18-$T18*0/3))","v":{"$error":"#VALUE!"}},{"$f":"IF($S$18=\"centro sx\",$AS$18+$R$18*COS($BB$18+$T18*1/3),$AS$18+$R$18*COS($BB$18-$T18*1/3))","v":{"$error":"#VALUE!"}},{"$f":"IF($S$18=\"centro sx\",$AS$18+$R$18*COS($BB$18+$T18*2/3),$AS$18+$R$18*COS($BB$18-$T18*2/3))","v":{"$error":"#VALUE!"}},{"$f":"IF($S$18=\"centro sx\",$AS$18+$R$18*COS($BB$18+$T18*3/3),$AS$18+$R$18*COS($BB$18-$T18*3/3))","v":{"$error":"#VALUE!"}},{"$f":"IF($S$18=\"centro sx\",$AS$18+$R$18*COS($BB$18+$T18*4/3),$AS$18+$R$18*COS($BB$18-$T18*4/3))","v":{"$error":"#VALUE!"}},{"$f":"IF($S$18=\"centro sx\",$AS$18+$R$18*COS($BB$18+$T18*5/3),$AS$18+$R$18*COS($BB$18-$T18*5/3))","v":{"$error":"#VALUE!"}},{"$f":"IF($S$18=\"centro sx\",$AS$18+$R$18*COS($BB$18+$T18*6/3),$AS$18+$R$18*COS($BB$18-$T18*6/3))","v":{"$error":"#VALUE!"}},null,{"$f":"V18","v":""},{"$f":"BK18+AE18*1/6*COS(AO18)","v":{"$error":"#VALUE!"}},{"$f":"BK18+AE18*2/6*COS(AO18)","v":{"$error":"#VALUE!"}},{"$f":"BK18+AE18*3/6*COS(AO18)","v":{"$error":"#VALUE!"}},{"$f":"BK18+AE18*4/6*COS(AO18)","v":{"$error":"#VALUE!"}},{"$f":"BK18+AE18*5/6*COS(AO18)","v":{"$error":"#VALUE!"}},{"$f":"BK18+AE18*6/6*COS(AO18)","v":{"$error":"#VALUE!"}},null,{"$f":"CONCATENATE(\"m\",O18,\" = √[(x\",Q19,\"-x\",Q18,\")²+(y\",Q19,\"-y\",Q18,,\")²] = √{[(\",FIXED(V19),\")-(\",,FIXED(V18),\")]²+[(\",,FIXED(W19),\")-(\",,FIXED(W18),\")]²} = \",FIXED(Z18),\" cm\")","v":{"$error":"#VALUE!"}},{"$f":"CONCATENATE(\"x\",O18,\" = (x\",Q19,\")+(x\",Q18,\")/2 = [(\",FIXED(W18),\")+(\",FIXED(V18),\")]/2 = \",FIXED(AA18),\" cm\")","v":{"$error":"#VALUE!"}},{"$f":"CONCATENATE(\"y\",O18,\" = (y\",Q19,\"+y\",Q18,\")/2 = [(\",FIXED(W19),\")+(\",FIXED(W18),\")]/2 = \",FIXED(AB18),\" cm\")","v":{"$error":"#VALUE!"}},{"$f":"CONCATENATE(\"m\",O18,\" =  R∙2ω = \",FIXED(R18),\"x2x\",FIXED(T18,4),\" = \",FIXED(Z18),\" cm\")","v":{"$error":"#VALUE!"}},{"$f":"CONCATENATE(\"OG\",O18,\" =  R∙sen(α)/α(rad) = \",FIXED(R18),\"xsen(\",FIXED(T18,4),\"/\",FIXED(T18,4),\" = \",FIXED(AU18),\" cm\")","v":{"$error":"#VALUE!"}},{"$f":"CONCATENATE(\"θ(OG) = \",FIXED(AW18,4),\" rad = \",FIXED(DEGREES(AW18),2),\"° deg\")","v":{"$error":"#VALUE!"}},{"$f":"CONCATENATE(\"x\",O18,\" = XO + OG∙cos[θ(OG)] = \",FIXED(AS18),\"+\",FIXED(AU18),\"xcos(\",FIXED(DEGREES(AW18),4),\"°) = \",FIXED(AX18),\" cm\")","v":{"$error":"#VALUE!"}},{"$f":"CONCATENATE(\"y\",O18,\" = yO + OG∙sen[θ(OG)] = \",FIXED(AT18),\"+\",FIXED(AU18),\"xcos(\",FIXED(DEGREES(AW18),4),\"°) = \",FIXED(AY18),\" cm\")","v":{"$error":"#VALUE!"}},{"$f":"IF(P18=\"\",\"\",IF(P18=\"segmento\",BS18,BV18))","v":""},{"$f":"IF(P18=\"\",\"\",IF(P18=\"segmento\",BT18,BY18))","v":""},{"$f":"IF(P18=\"\",\"\",IF(P18=\"segmento\",BU18,BZ18))","v":""},{"$f":"IF(OR(P18=\"\",P18=\"segmento\"),\"\",BW18)","v":""},{"$f":"IF(OR(P18=\"\",P18=\"segmento\"),\"\",BX18)","v":""},{"$f":"IF(P18=\"\",\"\",CONCATENATE(\"S\",O18,\"x = m\",O18,\"∙y\",O18,\" = \",FIXED(Z18),\"x(\",FIXED(AB18),\") = \",FIXED(AD18),\" cm²\"))","v":""},{"$f":"IF(P18=\"\",\"\",CONCATENATE(\"S\",O18,\"y = m\",O18,\"∙x\",O18,\" = \",FIXED(Z18),\"x(\",FIXED(AA18),\") = \",FIXED(AD18),\" cm²\"))","v":""}]
[null,null,null,null,null,null,null,null,null,null,null,null,null,null,null,null,null,null,null,null,null,{"$f":"IF(Q19=\"\",\"\",LOOKUP(Q19,'01'!$B$2:$V$2,'01'!$B$3:$V$3))","v":""},{"$f":"IF(Q19=\"\",\"\",LOOKUP(Q19,'01'!$B$2:$V$2,'01'!$B$4:$V$4))","v":""},null,null,null,null,null,null,null,null,null,null,null,null,null,{"$f":"IF(AND(X19=0,Y19>0),90,\"\")","v":""},{"$f":"IF(AND(X19=0,Y19<0),270,\"\")","v":""},"",{"$f":"IF(AND(X19<0,Y19=0),180,\"\")","v":""},{"$f":"MAXA(AF19:AM19)","v":0},null,null,null,null,null,null,null,null,{"$f":"IF($S$4=\"centro sx\",$AS$4+$R$4*COS($BB$4+$T19*3/3),$AS$4+$R$4*COS($BB$4-$T19*3/3))","v":{"$error":"#VALUE!"}},{"$f":"IF($S$4=\"centro sx\",$AT$4+$R$4*SIN($BB$4+$T$4*3/3),$AT$4+$R$4*SIN($BB$4-$T$4*3/3))","v":{"$error":"#VALUE!"}},null,"y",null,{"$f":"IF($S$18=\"centro sx\",$AT$16+$R$18*SIN($BB$18+$T$18*0/3),$AT$16+$R$18*SIN($BB$18-$T$18*0/3))","v":{"$error":"#VALUE!"}},{"$f":"IF($S$18=\"centro sx\",$AT$18+$R$18*SIN($BB$18+$T$18*1/3),$AT$18+$R$18*SIN($BB$18-$T$18*1/3))","v":{"$error":"#VALUE!"}},{"$f":"IF($S$18=\"centro sx\",$AT$18+$R$18*SIN($BB$18+$T$18*2/3),$AT$18+$R$18*SIN($BB$18-$T$18*2/3))","v":{"$error":"#VALUE!"}},{"$f":"IF($S$18=\"centro sx\",$AT$18+$R$18*SIN($BB$18+$T$18*3/3),$AT$18+$R$18*SIN($BB$18-$T$18*3/3))","v":{"$error":"#VALUE!"}},{"$f":"IF($S$18=\"centro sx\",$AT$18+$R$18*SIN($BB$18+$T$18*4/3),$AT$18+$R$18*SIN($BB$18-$T$18*4/3))","v":{"$error":"#VALUE!"}},{"$f":"IF($S$18=\"centro sx\",$AT$18+$R$18*SIN($BB$18+$T$18*5/3),$AT$18+$R$18*SIN($BB$18-$T$18*5/3))","v":{"$error":"#VALUE!"}},{"$f":"IF($S$18=\"centro sx\",$AT$18+$R$18*SIN($BB$18+$T$18*6/3),$AT$18+$R$18*SIN($BB$18-$T$18*6/3))","v":{"$error":"#VALUE!"}},null,{"$f":"W18","v":""},{"$f":"BK19+AE18*1/6*SIN(AO18)","v":{"$error":"#VALUE!"}},{"$f":"BK19+AE18*2/6*SIN(AO18)","v":{"$error":"#VALUE!"}},{"$f":"BK19+AE18*3/6*SIN(AO18)","v":{"$error":"#VALUE!"}},{"$f":"BK19+AE18*4/6*SIN(AO18)","v":{"$error":"#VALUE!"}},{"$f":"BK19+AE18*5/6*SIN(AO18)","v":{"$error":"#VALUE!"}},{"$f":"BK19+AE18*6/6*SIN(AO18)","v":{"$error":"#VALUE!"}}]
[null,null,null,null,null,null,null,null,null,null,null,null,null,null,"9",null,null,null,null,{"$f":"IF(OR(P20=\"\",P20=\"segmento\"),\"\",ASIN(0.5*AE20/R20))","v":""},{"$f":"IF(OR(P20=\"\",P20=\"segmento\"),\"\",PI()/2-T20)","v":""},{"$f":"IF(Q20=\"\",\"\",LOOKUP(Q20,'01'!$B$2:$V$2,'01'!$B$3:$V$3))","v":""},{"$f":"IF(Q20=\"\",\"\",LOOKUP(Q20,'01'!$B$2:$V$2,'01'!$B$4:$V$4))","v":""},"",{"$f":"IF(P20=\"\",\"\",W21-W20)","v":""},{"$f":"IF(P20=\"\",\"\",IF(P20=\"segmento\",SQRT(X20^2+Y20^2),R20*2*T20))","v":""},{"$f":"IF(P20=\"\",\"\",IF(P20=\"segmento\",(V20+V21)/2,AX20))","v":""},{"$f":"IF(P20=\"\",\"\",IF(P20=\"segmento\",(W20+W21)/2,AY20))","v":""},{"$f":"IF(P20=\"\",\"\",Z20*AB20)","v":""},{"$f":"IF(P20=\"\",\"\",Z20*AA20)","v":""},{"$f":"IF(P20=\"\",\"\",SQRT(X20^2+Y20^2))","v":""},{"$f":"ATAN(Y20/X20)","v":{"$error":"#VALUE!"}},{"$f":"IF(AND(X20>0,Y20>0),AF20,\"\")","v":{"$error":"#VALUE!"}},{"$f":"IF(AND(X20<0,Y20>0),AF20+PI(),\"\")","v":""},{"$f":"IF(AND(X20<0,Y20<0),AF20+PI(),\"\")","v":""},{"$f":"IF(AND(X20>0,Y20<0),AF20+2*PI(),\"\")","v":""},{"$f":"IF(AND(X20=0,Y20>0),PI()/2,\"\")","v":""},{"$f":"IF(AND(X20=0,Y20<0),1.5*PI(),\"\")","v":""},"",{"$f":"IF(AND(X20<0,Y20=0),PI(),\"\")","v":""},{"$f":"IF(P20=\"\",\"\",MAXA(AG20:AN21))","v":""},null,{"$f":"IF(OR(P20=\"\",P20=\"segmento\"),\"\",IF(S20=\"centro sx\",AO20+U20,2*PI()-(U20-AO20)))","v":""},{"$f":"IF(OR(P20=\"\",P20=\"segmento\"),\"\",IF(AQ20>2*PI(),AQ20-2*PI(),AQ20))","v":""},{"$f":"IF(OR(P20=\"\",P20=\"segmento\"),\"\",V20+R20*COS(AR20))","v":""},{"$f":"IF(OR(P20=\"\",P20=\"segmento\"),\"\",W20+R20*SIN(AR20))","v":""},{"$f":"IF(OR(P20=\"\",P20=\"segmento\"),\"\",R20*SIN(T20)/T20)","v":""},{"$f":"IF(OR(P20=\"\",P20=\"segmento\"),\"\",AR20+PI()+T20)","v":""},{"$f":"IF(OR(P20=\"\",P20=\"segmento\"),\"\",BB20+T20)","v":""},{"$f":"IF(OR(P20=\"\",P20=\"segmento\"),\"\",IF(S20=\"centro sx\",AS20+AU20*COS(BB20+T20*3/3),AS20+AU20*COS(BB20-T20*3/3)))","v":""},{"$f":"IF(OR(P20=\"\",P20=\"segmento\"),\"\",IF(S20=\"centro sx\",AT20+AU20*SIN(BB20+T20*3/3),AT20+AU20*SIN(BB20-T20*3/3)))","v":""},null,"x",{"$f":"IF(AR20-PI()<0,AR20+PI(),AR20-PI())","v":{"$error":"#VALUE!"}},{"$f":"IF(S20=\"centro sx\",AS20+R20*COS(BB20+T20*0/3),$AS$20+$R$20*COS($BB$20-$T20*0/3))","v":{"$error":"#VALUE!"}},{"$f":"IF($S$20=\"centro sx\",$AS$20+$R$20*COS($BB$20+$T20*1/3),$AS$20+$R$20*COS($BB$6-$T20*1/3))","v":{"$error":"#VALUE!"}},{"$f":"IF($S$20=\"centro sx\",$AS$20+$R$20*COS($BB$20+$T20*2/3),$AS$20+$R$20*COS($BB$20-$T20*2/3))","v":{"$error":"#VALUE!"}},{"$f":"IF($S$20=\"centro sx\",$AS$20+$R$20*COS($BB$20+$T20*3/3),$AS$20+$R$20*COS($BB$20-$T20*3/3))","v":{"$error":"#VALUE!"}},{"$f":"IF($S$20=\"centro sx\",$AS$20+$R$20*COS($BB$20+$T20*4/3),$AS$20+$R$20*COS($BB$20-$T20*4/3))","v":{"$error":"#VALUE!"}},{"$f":"IF($S$20=\"centro sx\",$AS$20+$R$20*COS($BB$20+$T20*5/3),$AS$20+$R$20*COS($BB$20-$T20*5/3))","v":{"$error":"#VALUE!"}},{"$f":"IF($S$20=\"centro sx\",$AS$20+$R$20*COS($BB$20+$T20*6/3),$AS$20+$R$20*COS($BB$20-$T20*6/3))","v":{"$error":"#VALUE!"}},null,{"$f":"V20","v":""},{"$f":"BK20+AE20*1/6*COS(AO20)","v":{"$error":"#VALUE!"}},{"$f":"BK20+AE20*2/6*COS(AO20)","v":{"$error":"#VALUE!"}},{"$f":"BK20+AE20*3/6*COS(AO20)","v":{"$error":"#VALUE!"}},{"$f":"BK20+AE20*4/6*COS(AO20)","v":{"$error":"#VALUE!"}},{"$f":"BK20+AE20*5/6*COS(AO20)","v":{"$error":"#VALUE!"}},{"$f":"BK20+AE20*6/6*COS(AO20)","v":{"$error":"#VALUE!"}},null,{"$f":"CONCATENATE(\"m\",O20,\" = √[(x\",Q21,\"-x\",Q20,\")²+(y\",Q21,\"-y\",Q20,,\")²] = √{[(\",FIXED(V21),\")-(\",,FIXED(V20),\")]²+[(\",,FIXED(W21),\")-(\",,FIXED(W20),\")]²} = \",FIXED(Z20),\" cm\")","v":{"$error":"#VALUE!"}},{"$f":"CONCATENATE(\"x\",O20,\" = (x\",Q21,\")+(x\",Q20,\")/2 = [(\",FIXED(W20),\")+(\",FIXED(V20),\")]/2 = \",FIXED(AA20),\" cm\")","v":{"$error":"#VALUE!"}},{"$f":"CONCATENATE(\"y\",O20,\" = (y\",Q21,\"+y\",Q20,\")/2 = [(\",FIXED(W21),\")+(\",FIXED(W20),\")]/2 = \",FIXED(AB20),\" cm\")","v":{"$error":"#VALUE!"}},{"$f":"CONCATENATE(\"m\",O20,\" =  R∙2ω = \",FIXED(R20),\"x2x\",FIXED(T20,4),\" = \",FIXED(Z20),\" cm\")","v":{"$error":"#VALUE!"}},{"$f":"CONCATENATE(\"OG\",O20,\" =  R∙sen(α)/α(rad) = \",FIXED(R20),\"xsen(\",FIXED(T20,4),\"/\",FIXED(T20,4),\" = \",FIXED(AU20),\" cm\")","v":{"$error":"#VALUE!"}},{"$f":"CONCATENATE(\"θ(OG) = \",FIXED(AW20,4),\" rad = \",FIXED(DEGREES(AW20),2),\"° deg\")","v":{"$error":"#VALUE!"}},{"$f":"CONCATENATE(\"x\",O20,\" = XO + OG∙cos[θ(OG)] = \",FIXED(AS20),\"+\",FIXED(AU20),\"xcos(\",FIXED(DEGREES(AW20),4),\"°) = \",FIXED(AX20),\" cm\")","v":{"$error":"#VALUE!"}},{"$f":"CONCATENATE(\"y\",O20,\" = yO + OG∙sen[θ(OG)] = \",FIXED(AT20),\"+\",FIXED(AU20),\"xcos(\",FIXED(DEGREES(AW20),4),\"°) = \",FIXED(AY20),\" cm\")","v":{"$error":"#VALUE!"}},{"$f":"IF(P20=\"\",\"\",IF(P20=\"segmento\",BS20,BV20))","v":""},{"$f":"IF(P20=\"\",\"\",IF(P20=\"segmento\",BT20,BY20))","v":""},{"$f":"IF(P20=\"\",\"\",IF(P20=\"segmento\",BU20,BZ20))","v":""},{"$f":"IF(OR(P20=\"\",P20=\"segmento\"),\"\",BW20)","v":""},{"$f":"IF(OR(P20=\"\",P20=\"segmento\"),\"\",BX20)","v":""},{"$f":"IF(P20=\"\",\"\",CONCATENATE(\"S\",O20,\"x = m\",O20,\"∙y\",O20,\" = \",FIXED(Z20),\"x(\",FIXED(AB20),\") = \",FIXED(AD20),\" cm²\"))","v":""},{"$f":"IF(P20=\"\",\"\",CONCATENATE(\"S\",O20,\"y = m\",O20,\"∙x\",O20,\" = \",FIXED(Z20),\"x(\",FIXED(AA20),\") = \",FIXED(AD20),\" cm²\"))","v":""}]
[null,null,null,null,null,null,null,null,null,null,null,null,null,null,null,null,null,null,null,null,null,{"$f":"IF(Q21=\"\",\"\",LOOKUP(Q21,'01'!$B$2:$V$2,'01'!$B$3:$V$3))","v":""},{"$f":"IF(Q21=\"\",\"\",LOOKUP(Q21,'01'!$B$2:$V$2,'01'!$B$4:$V$4))","v":""},null,null,null,null,null,null,null,null,null,null,null,null,null,{"$f":"IF(AND(X21=0,Y21>0),90,\"\")","v":""},{"$f":"IF(AND(X21=0,Y21<0),270,\"\")","v":""},"",{"$f":"IF(AND(X21<0,Y21=0),180,\"\")","v":""},{"$f":"MAXA(AF21:AM21)","v":0},null,null,null,null,null,null,null,null,{"$f":"IF($S$4=\"centro sx\",$AS$4+$R$4*COS($BB$4+$T21*3/3),$AS$4+$R$4*COS($BB$4-$T21*3/3))","v":{"$error":"#VALUE!"}},{"$f":"IF($S$4=\"centro sx\",$AT$4+$R$4*SIN($BB$4+$T$4*3/3),$AT$4+$R$4*SIN($BB$4-$T$4*3/3))","v":{"$error":"#VALUE!"}},null,"y",null,{"$f":"IF($S$20=\"centro sx\",$AT$20+$R$20*SIN($BB$20+$T$20*0/3),$AT$20+$R$20*SIN($BB$20-$T$20*0/3))","v":{"$error":"#VALUE!"}},{"$f":"IF($S$20=\"centro sx\",$AT$20+$R$20*SIN($BB$20+$T$20*1/3),$AT$20+$R$20*SIN($BB$20-$T$20*1/3))","v":{"$error":"#VALUE!"}},{"$f":"IF($S$20=\"centro sx\",$AT$20+$R$20*SIN($BB$20+$T$20*2/3),$AT$20+$R$20*SIN($BB$20-$T$20*2/3))","v":{"$error":"#VALUE!"}},{"$f":"IF($S$20=\"centro sx\",$AT$20+$R$20*SIN($BB$20+$T$20*3/3),$AT$20+$R$20*SIN($BB$20-$T$20*3/3))","v":{"$error":"#VALUE!"}},{"$f":"IF($S$20=\"centro sx\",$AT$20+$R$20*SIN($BB$20+$T$20*4/3),$AT$20+$R$20*SIN($BB$20-$T$20*4/3))","v":{"$error":"#VALUE!"}},{"$f":"IF($S$20=\"centro sx\",$AT$20+$R$20*SIN($BB$20+$T$20*5/3),$AT$20+$R$20*SIN($BB$20-$T$20*5/3))","v":{"$error":"#VALUE!"}},{"$f":"IF($S$20=\"centro sx\",$AT$20+$R$20*SIN($BB$20+$T$20*6/3),$AT$20+$R$20*SIN($BB$20-$T$20*6/3))","v":{"$error":"#VALUE!"}},null,{"$f":"W20","v":""},{"$f":"BK21+AE20*1/6*SIN(AO20)","v":{"$error":"#VALUE!"}},{"$f":"BK21+AE20*2/6*SIN(AO20)","v":{"$error":"#VALUE!"}},{"$f":"BK21+AE20*3/6*SIN(AO20)","v":{"$error":"#VALUE!"}},{"$f":"BK21+AE20*4/6*SIN(AO20)","v":{"$error":"#VALUE!"}},{"$f":"BK21+AE20*5/6*SIN(AO20)","v":{"$error":"#VALUE!"}},{"$f":"BK21+AE20*6/6*SIN(AO20)","v":{"$error":"#VALUE!"}}]
[null,null,null,null,null,null,null,null,null,null,null,null,null,null,"10",null,null,null,null,{"$f":"IF(OR(P22=\"\",P22=\"segmento\"),\"\",ASIN(0.5*AE22/R22))","v":""},{"$f":"IF(OR(P22=\"\",P22=\"segmento\"),\"\",PI()/2-T22)","v":""},{"$f":"IF(Q22=\"\",\"\",LOOKUP(Q22,'01'!$B$2:$V$2,'01'!$B$3:$V$3))","v":""},{"$f":"IF(Q22=\"\",\"\",LOOKUP(Q22,'01'!$B$2:$V$2,'01'!$B$4:$V$4))","v":""},"",{"$f":"IF(P22=\"\",\"\",W23-W22)","v":""},{"$f":"IF(P22=\"\",\"\",IF(P22=\"segmento\",SQRT(X22^2+Y22^2),R22*2*T22))","v":""},{"$f":"IF(P22=\"\",\"\",IF(P22=\"segmento\",(V22+V23)/2,AX22))","v":""},{"$f":"IF(P22=\"\",\"\",IF(P22=\"segmento\",(W22+W23)/2,AY22))","v":""},{"$f":"IF(P22=\"\",\"\",Z22*AB22)","v":""},{"$f":"IF(P22=\"\",\"\",Z22*AA22)","v":""},{"$f":"IF(P22=\"\",\"\",SQRT(X22^2+Y22^2))","v":""},{"$f":"ATAN(Y22/X22)","v":{"$error":"#VALUE!"}},{"$f":"IF(AND(X22>0,Y22>0),AF22,\"\")","v":{"$error":"#VALUE!"}},{"$f":"IF(AND(X22<0,Y22>0),AF22+PI(),\"\")","v":""},{"$f":"IF(AND(X22<0,Y22<0),AF22+PI(),\"\")","v":""},{"$f":"IF(AND(X22>0,Y22<0),AF22+2*PI(),\"\")","v":""},{"$f":"IF(AND(X22=0,Y22>0),PI()/2,\"\")","v":""},{"$f":"IF(AND(X22=0,Y22<0),1.5*PI(),\"\")","v":""},"",{"$f":"IF(AND(X22<0,Y22=0),PI(),\"\")","v":""},{"$f":"IF(P22=\"\",\"\",MAXA(AG22:AN23))","v":""},null,{"$f":"IF(OR(P22=\"\",P22=\"segmento\"),\"\",IF(S22=\"centro sx\",AO22+U22,2*PI()-(U22-AO22)))","v":""},{"$f":"IF(OR(P22=\"\",P22=\"segmento\"),\"\",IF(AQ22>2*PI(),AQ22-2*PI(),AQ22))","v":""},{"$f":"IF(OR(P22=\"\",P22=\"segmento\"),\"\",V22+R22*COS(AR22))","v":""},{"$f":"IF(OR(P22=\"\",P22=\"segmento\"),\"\",W22+R22*SIN(AR22))","v":""},{"$f":"IF(OR(P22=\"\",P22=\"segmento\"),\"\",R22*SIN(T22)/T22)","v":""},{"$f":"IF(OR(P22=\"\",P22=\"segmento\"),\"\",AR22+PI()+T22)","v":""},{"$f":"IF(OR(P22=\"\",P22=\"segmento\"),\"\",BB22+T22)","v":""},{"$f":"IF(OR(P22=\"\",P22=\"segmento\"),\"\",IF(S22=\"centro sx\",AS22+AU22*COS(BB22+T22*3/3),AS22+AU22*COS(BB22-T22*3/3)))","v":""},{"$f":"IF(OR(P22=\"\",P22=\"segmento\"),\"\",IF(S22=\"centro sx\",AT22+AU22*SIN(BB22+T22*3/3),AT22+AU22*SIN(BB22-T22*3/3)))","v":""},null,"x",{"$f":"IF(AR22-PI()<0,AR22+PI(),AR22-PI())","v":{"$error":"#VALUE!"}},{"$f":"IF(S22=\"centro sx\",AS22+R22*COS(BB22+T22*0/3),$AS$22+$R$22*COS($BB$22-$T22*0/3))","v":{"$error":"#VALUE!"}},{"$f":"IF($S$22=\"centro sx\",$AS$22+$R$22*COS($BB$22+$T22*1/3),$AS$22+$R$22*COS($BB$22-$T22*1/3))","v":{"$error":"#VALUE!"}},{"$f":"IF($S$22=\"centro sx\",$AS$22+$R$22*COS($BB$22+$T22*2/3),$AS$22+$R$22*COS($BB$22-$T22*2/3))","v":{"$error":"#VALUE!"}},{"$f":"IF($S$22=\"centro sx\",$AS$22+$R$22*COS($BB$22+$T22*3/3),$AS$22+$R$22*COS($BB$22-$T22*3/3))","v":{"$error":"#VALUE!"}},{"$f":"IF($S$22=\"centro sx\",$AS$22+$R$22*COS($BB$22+$T22*4/3),$AS$22+$R$22*COS($BB$22-$T22*4/3))","v":{"$error":"#VALUE!"}},{"$f":"IF($S$22=\"centro sx\",$AS$22+$R$22*COS($BB$22+$T22*5/3),$AS$22+$R$22*COS($BB$22-$T22*5/3))","v":{"$error":"#VALUE!"}},{"$f":"IF($S$22=\"centro sx\",$AS$22+$R$22*COS($BB$22+$T22*6/3),$AS$22+$R$22*COS($BB$22-$T22*6/3))","v":{"$error":"#VALUE!"}},null,{"$f":"V22","v":""},{"$f":"BK22+AE22*1/6*COS(AO22)","v":{"$error":"#VALUE!"}},{"$f":"BK22+AE22*2/6*COS(AO22)","v":{"$error":"#VALUE!"}},{"$f":"BK22+AE22*3/6*COS(AO22)","v":{"$error":"#VALUE!"}},{"$f":"BK22+AE22*4/6*COS(AO22)","v":{"$error":"#VALUE!"}},{"$f":"BK22+AE22*5/6*COS(AO22)","v":{"$error":"#VALUE!"}},{"$f":"BK22+AE22*6/6*COS(AO22)","v":{"$error":"#VALUE!"}},null,{"$f":"CONCATENATE(\"m\",O22,\" = √[(x\",Q23,\"-x\",Q22,\")²+(y\",Q23,\"-y\",Q22,,\")²] = √{[(\",FIXED(V23),\")-(\",,FIXED(V22),\")]²+[(\",,FIXED(W23),\")-(\",,FIXED(W22),\")]²} = \",FIXED(Z22),\" cm\")","v":{"$error":"#VALUE!"}},{"$f":"CONCATENATE(\"x\",O22,\" = (x\",Q23,\")+(x\",Q22,\")/2 = [(\",FIXED(W22),\")+(\",FIXED(V22),\")]/2 = \",FIXED(AA22),\" cm\")","v":{"$error":"#VALUE!"}},{"$f":"CONCATENATE(\"y\",O22,\" = (y\",Q23,\"+y\",Q22,\")/2 = [(\",FIXED(W23),\")+(\",FIXED(W22),\")]/2 = \",FIXED(AB22),\" cm\")","v":{"$error":"#VALUE!"}},{"$f":"CONCATENATE(\"m\",O22,\" =  R∙2ω = \",FIXED(R22),\"x2x\",FIXED(T22,4),\" = \",FIXED(Z22),\" cm\")","v":{"$error":"#VALUE!"}},{"$f":"CONCATENATE(\"OG\",O22,\" =  R∙sen(α)/α(rad) = \",FIXED(R22),\"xsen(\",FIXED(T22,4),\"/\",FIXED(T22,4),\" = \",FIXED(AU22),\" cm\")","v":{"$error":"#VALUE!"}},{"$f":"CONCATENATE(\"θ(OG) = \",FIXED(AW22,4),\" rad = \",FIXED(DEGREES(AW22),2),\"° deg\")","v":{"$error":"#VALUE!"}},{"$f":"CONCATENATE(\"x\",O22,\" = XO + OG∙cos[θ(OG)] = \",FIXED(AS22),\"+\",FIXED(AU22),\"xcos(\",FIXED(DEGREES(AW22),4),\"°) = \",FIXED(AX22),\" cm\")","v":{"$error":"#VALUE!"}},{"$f":"CONCATENATE(\"y\",O22,\" = yO + OG∙sen[θ(OG)] = \",FIXED(AT22),\"+\",FIXED(AU22),\"xcos(\",FIXED(DEGREES(AW22),4),\"°) = \",FIXED(AY22),\" cm\")","v":{"$error":"#VALUE!"}},{"$f":"IF(P22=\"\",\"\",IF(P22=\"segmento\",BS22,BV22))","v":""},{"$f":"IF(P22=\"\",\"\",IF(P22=\"segmento\",BT22,BY22))","v":""},{"$f":"IF(P22=\"\",\"\",IF(P22=\"segmento\",BU22,BZ22))","v":""},{"$f":"IF(OR(P22=\"\",P22=\"segmento\"),\"\",BW22)","v":""},{"$f":"IF(OR(P22=\"\",P22=\"segmento\"),\"\",BX22)","v":""},{"$f":"IF(P22=\"\",\"\",CONCATENATE(\"S\",O22,\"x = m\",O22,\"∙y\",O22,\" = \",FIXED(Z22),\"x(\",FIXED(AB22),\") = \",FIXED(AD22),\" cm²\"))","v":""},{"$f":"IF(P22=\"\",\"\",CONCATENATE(\"S\",O22,\"y = m\",O22,\"∙x\",O22,\" = \",FIXED(Z22),\"x(\",FIXED(AA22),\") = \",FIXED(AD22),\" cm²\"))","v":""}]
[null,null,null,null,null,null,null,null,null,null,null,null,null,null,null,null,null,null,null,null,null,{"$f":"IF(Q23=\"\",\"\",LOOKUP(Q23,'01'!$B$2:$V$2,'01'!$B$3:$V$3))","v":""},{"$f":"IF(Q23=\"\",\"\",LOOKUP(Q23,'01'!$B$2:$V$2,'01'!$B$4:$V$4))","v":""},null,null,null,null,null,null,null,null,null,null,null,null,null,{"$f":"IF(AND(X23=0,Y23>0),90,\"\")","v":""},{"$f":"IF(AND(X23=0,Y23<0),270,\"\")","v":""},"",{"$f":"IF(AND(X23<0,Y23=0),180,\"\")","v":""},{"$f":"MAXA(AF23:AM23)","v":0},null,null,null,null,null,null,null,null,{"$f":"IF($S$4=\"centro sx\",$AS$4+$R$4*COS($BB$4+$T23*3/3),$AS$4+$R$4*COS($BB$4-$T23*3/3))","v":{"$error":"#VALUE!"}},{"$f":"IF($S$4=\"centro sx\",$AT$4+$R$4*SIN($BB$4+$T$4*3/3),$AT$4+$R$4*SIN($BB$4-$T$4*3/3))","v":{"$error":"#VALUE!"}},null,"y",null,{"$f":"IF($S$22=\"centro sx\",$AT$22+$R$22*SIN($BB$22+$T$22*0/3),$AT$22+$R$22*SIN($BB$22-$T$22*0/3))","v":{"$error":"#VALUE!"}},{"$f":"IF($S$22=\"centro sx\",$AT$22+$R$22*SIN($BB$22+$T$22*1/3),$AT$22+$R$22*SIN($BB$22-$T$22*1/3))","v":{"$error":"#VALUE!"}},{"$f":"IF($S$22=\"centro sx\",$AT$22+$R$22*SIN($BB$22+$T$22*2/3),$AT$22+$R$22*SIN($BB$22-$T$22*2/3))","v":{"$error":"#VALUE!"}},{"$f":"IF($S$22=\"centro sx\",$AT$22+$R$22*SIN($BB$22+$T$22*3/3),$AT$22+$R$22*SIN($BB$22-$T$22*3/3))","v":{"$error":"#VALUE!"}},{"$f":"IF($S$22=\"centro sx\",$AT$22+$R$22*SIN($BB$22+$T$22*4/3),$AT$22+$R$22*SIN($BB$22-$T$22*4/3))","v":{"$error":"#VALUE!"}},{"$f":"IF($S$22=\"centro sx\",$AT$22+$R$22*SIN($BB$22+$T$22*5/3),$AT$22+$R$22*SIN($BB$22-$T$22*5/3))","v":{"$error":"#VALUE!"}},{"$f":"IF($S$22=\"centro sx\",$AT$22+$R$22*SIN($BB$22+$T$22*6/3),$AT$22+$R$22*SIN($BB$22-$T$22*6/3))","v":{"$error":"#VALUE!"}},null,{"$f":"W22","v":""},{"$f":"BK23+AE22*1/6*SIN(AO22)","v":{"$error":"#VALUE!"}},{"$f":"BK23+AE22*2/6*SIN(AO22)","v":{"$error":"#VALUE!"}},{"$f":"BK23+AE22*3/6*SIN(AO22)","v":{"$error":"#VALUE!"}},{"$f":"BK23+AE22*4/6*SIN(AO22)","v":{"$error":"#VALUE!"}},{"$f":"BK23+AE22*5/6*SIN(AO22)","v":{"$error":"#VALUE!"}},{"$f":"BK23+AE22*6/6*SIN(AO22)","v":{"$error":"#VALUE!"}}]
[null,null,null,null,null,null,null,null,null,null,null,null,null,null,null,null,null,null,null,null,null,null,null,null,null,{"$f":"SUM(Z4:Z23)","v":48.004050140305182},null,null,{"$f":"SUM(AC4:AC23)","v":-15.748777072062744},{"$f":"SUM(AD4:AD23)","v":163.57469925324841}]
[]
["** centro a destra (Cdx) centro a sinistra (Csx) si trovano,  indicata la corda con IJ, seguendo, in verso orario, la sequenza  I-Csx,J,Cdx,",null,null,null,null,null,null,null,null,null,null,null,null,null,null,null,null,null,null,{"$f":"CONCATENATE(\"XG = Sy/∑m = \",FIXED(AD24),\"/\",FIXED(Z24), \" =\" )","v":"XG = Sy/∑m = 163.57/48.00 ="},{"$f":"AD24/Z24","v":3.4075187150908284},"cm"]
[null,null,null,null,null,null,null,null,null,null,null,null,null,null,null,null,null,null,null,{"$f":"CONCATENATE(\"YG = Sx/∑m = \",FIXED(AC24),\"/\",FIXED(Z24), \" =\" )","v":"YG = Sx/∑m = -15.75/48.00 ="},{"$f":"AC24/Z24","v":-0.32807184031415193},"cm"]
[null,{"$f":"IF(P5=\"\",\"\",CONCATENATE(\"Fig. \",O5,\"  - \",P5))","v":""}]
[null,{"$f":"IF(P4=\"\",\"\",CONCATENATE(\"Fig.\",O4,\" - \",P4))","v":"Fig.1 - segmento"}]
[null,{"$f":"CA4","v":"m1 = √[(xB-xA)²+(yB-yA)²] = √{[(8.00)-(-2.00)]²+[(6.00)-(5.00)]²} = 10.05 cm"},null,null,null,null,null,null,null,null,null,null,null,null,null,{"$f":"IF(P4=\"arco circ.\",CONCATENATE(\" R = \",FIXED(R4),\" cm\"),\"\")","v":""}]
[null,{"$f":"CB4","v":"x1 = (xB)+(xA)/2 = [(5.00)+(-2.00)]/2 = 3.00 cm"},null,null,null,null,null,null,null,null,null,null,null,null,null,{"$f":"IF(P4=\"arco circ.\",CONCATENATE(\" ω = \", FIXED(T4,4),\" rad = \",FIXED(DEGREES(T4),4),\"° deg\"),\"\")","v":""}]
[null,{"$f":"CC4","v":"y1 = (yB+yA)/2 = [(6.00)+(5.00)]/2 = 5.50 cm"},null,null,null,null,null,null,null,null,null,null,null,null,null,{"$f":"CD4","v":""}]
[null,null,null,null,null,null,null,null,null,null,null,null,null,null,null,{"$f":"CE4","v":""}]
[null,{"$f":"CF4","v":"S1x = m1∙y1 = 10.05x(5.50) = 30.15 cm²"},null,null,null,null,null,null,null,null,null,null,null,null,null,{"$f":"IF(P4=\"arco circ.\",CONCATENATE(\"Xo\",O4,\" = \",FIXED(AS4),\" cm\"),\"\")","v":""}]
[null,{"$f":"CG4","v":"S1y = m1∙x1 = 10.05x(3.00) = 30.15 cm²"},null,null,null,null,null,null,null,null,null,null,null,null,null,{"$f":"IF(P4=\"arco circ.\",CONCATENATE(\"Xo\",O4,\" = \",FIXED(AT4),\" cm\"),\"\")","v":""}]
[null,{"$f":"IF(P6=\"\",\"\",CONCATENATE(\"Fig.\",O6,\" - \",P6))","v":"Fig.2 - arco circ."}]
[null,{"$f":"CA6","v":"m2 =  R∙2ω = 5.00x2x1.5708 = 15.71 cm"},null,null,null,null,null,null,null,null,null,null,null,null,null,{"$f":"IF(P6=\"arco circ.\",CONCATENATE(\" R = \",FIXED(R6),\" cm\"),\"\")","v":" R = 5.00 cm"}]
[null,{"$f":"CB6","v":"x2 = XO + OG∙cos[θ(OG)] = 8.00+3.18xcos(180.0000°) = 11.18 cm"},null,null,null,null,null,null,null,null,null,null,null,null,null,{"$f":"IF(P6=\"arco circ.\",CONCATENATE(\" ω = \", FIXED(T6,4),\" rad = \",FIXED(DEGREES(T6),4),\"° deg\"),\"\")","v":" ω = 1.5708 rad = 90.0000° deg"}]
[null,{"$f":"CC6","v":"y2 = yO + OG∙sen[θ(OG)] = 1.00+3.18xsen(180.0000°) = 1.00 cm"},null,null,null,null,null,null,null,null,null,null,null,null,null,{"$f":"CD6","v":"OG2 =  R∙sen(α)/α(rad) = 5.00xsen(1.5708/1.5708 = 3.18 cm"}]
[null,null,null,null,null,null,null,null,null,null,null,null,null,null,null,{"$f":"CE6","v":"θ(OG) = 3.1416 rad = 180.00° deg"}]
[null,{"$f":"CF6","v":"S2x = m2∙y2 = 15.71x(1.00) = 175.66 cm²"},null,null,null,null,null,null,null,null,null,null,null,null,null,{"$f":"IF(P6=\"arco circ.\",CONCATENATE(\"Xo\",O6,\" = \",FIXED(AS6),\" cm\"),\"\")","v":"Xo2 = 8.00 cm"}]
[null,{"$f":"CG6","v":"S2y = m2∙x2 = 15.71x(11.18) = 175.66 cm²"},null,null,null,null,null,null,null,null,null,null,null,null,null,{"$f":"IF(P6=\"arco circ.\",CONCATENATE(\"Xo\",O6,\" = \",FIXED(AT6),\" cm\"),\"\")","v":"Xo2 = 1.00 cm"}]
[null,{"$f":"IF(P8=\"\",\"\",CONCATENATE(\"Fig.\",O8,\" - \",P8))","v":"Fig.3 - segmento"}]
[null,{"$f":"CA8","v":"m3 = √[(xD-xC)²+(yD-yC)²] = √{[(1.00)-(8.00)]²+[(-4.00)-(-4.00)]²} = 7.00 cm"},null,null,null,null,null,null,null,null,null,null,null,null,null,{"$f":"IF(P8=\"arco circ.\",CONCATENATE(\" R = \",FIXED(R8),\" cm\"),\"\")","v":""}]
[null,{"$f":"CB8","v":"x3 = (xD)+(xC)/2 = [(-4.00)+(8.00)]/2 = 4.50 cm"},null,null,null,null,null,null,null,null,null,null,null,null,null,{"$f":"IF(P8=\"arco circ.\",CONCATENATE(\" ω = \", FIXED(T8,4),\" rad = \",FIXED(DEGREES(T8),4),\"° deg\"),\"\")","v":""}]
[null,{"$f":"CC8","v":"y3 = (yD+yC)/2 = [(-4.00)+(-4.00)]/2 = -4.00 cm"},null,null,null,null,null,null,null,null,null,null,null,null,null,{"$f":"CD8","v":""}]
[null,null,null,null,null,null,null,null,null,null,null,null,null,null,null,{"$f":"CE8","v":""}]
[null,{"$f":"CF8","v":"S3x = m3∙y3 = 7.00x(-4.00) = 31.50 cm²"},null,null,null,null,null,null,null,null,null,null,null,null,null,{"$f":"IF(P8=\"arco circ.\",CONCATENATE(\"Xo\",O8,\" = \",FIXED(AS8),\" cm\"),\"\")","v":""}]
[null,{"$f":"CG8","v":"S3y = m3∙x3 = 7.00x(4.50) = 31.50 cm²"},null,null,null,null,null,null,null,null,null,null,null,null,null,{"$f":"IF(P8=\"arco circ.\",CONCATENATE(\"Xo\",O8,\" = \",FIXED(AT8),\" cm\"),\"\")","v":""}]
[null,{"$f":"IF(P10=\"\",\"\",CONCATENATE(\"Fig.\",O10,\" - \",P10))","v":"Fig.4 - segmento"}]
[null,{"$f":"CA10","v":"m4 = √[(xE-xD)²+(yE-yD)²] = √{[(-7.00)-(1.00)]²+[(-6.00)-(-4.00)]²} = 8.25 cm"},null,null,null,null,null,null,null,null,null,null,null,null,null,{"$f":"IF(P10=\"arco circ.\",CONCATENATE(\" R = \",FIXED(R10),\" cm\"),\"\")","v":""}]
[null,{"$f":"CB10","v":"x4 = (xE)+(xD)/2 = [(-4.00)+(1.00)]/2 = -3.00 cm"},null,null,null,null,null,null,null,null,null,null,null,null,null,{"$f":"IF(O10=\"arco circ.\",CONCATENATE(\" ω = \", FIXED(T10,4),\" rad = \",FIXED(DEGREES(T10),4),\"° deg\"),\"\")","v":""}]
[null,{"$f":"CC12","v":"y5 = (yF+yE)/2 = [(1.00)+(-6.00)]/2 = -2.50 cm"},null,null,null,null,null,null,null,null,null,null,null,null,null,{"$f":"CD10","v":""}]
[null,null,null,null,null,null,null,null,null,null,null,null,null,null,null,{"$f":"CE10","v":""}]
[null,{"$f":"CF10","v":"S4x = m4∙y4 = 8.25x(-5.00) = -24.74 cm²"},null,null,null,null,null,null,null,null,null,null,null,null,null,{"$f":"IF(P10=\"arco circ.\",CONCATENATE(\"Xo\",O10,\" = \",FIXED(AS10),\" cm\"),\"\")","v":""}]
[null,{"$f":"CG10","v":"S4y = m4∙x4 = 8.25x(-3.00) = -24.74 cm²"},null,null,null,null,null,null,null,null,null,null,null,null,null,{"$f":"IF(P10=\"arco circ.\",CONCATENATE(\"Xo\",O10,\" = \",FIXED(AT10),\" cm\"),\"\")","v":""}]
[null,{"$f":"IF(P12=\"\",\"\",CONCATENATE(\"Fig.\",O12,\" - \",P12))","v":"Fig.5 - segmento"}]
[null,{"$f":"CA12","v":"m5 = √[(xF-xE)²+(yF-yE)²] = √{[(-7.00)-(-7.00)]²+[(1.00)-(-6.00)]²} = 7.00 cm"},null,null,null,null,null,null,null,null,null,null,null,null,null,{"$f":"IF(P12=\"arco circ.\",CONCATENATE(\" R = \",FIXED(R12),\" cm\"),\"\")","v":""}]
[null,{"$f":"CB12","v":"x5 = (xF)+(xE)/2 = [(-6.00)+(-7.00)]/2 = -7.00 cm"},null,null,null,null,null,null,null,null,null,null,null,null,null,{"$f":"IF(P12=\"arco circ.\",CONCATENATE(\" ω = \", FIXED(T12,4),\" rad = \",FIXED(DEGREES(T12),4),\"° deg\"),\"\")","v":""}]
[null,{"$f":"CC12","v":"y5 = (yF+yE)/2 = [(1.00)+(-6.00)]/2 = -2.50 cm"},null,null,null,null,null,null,null,null,null,null,null,null,null,{"$f":"CD12","v":""}]
[null,null,null,null,null,null,null,null,null,null,null,null,null,null,null,{"$f":"CE12","v":""}]
[null,{"$f":"CF12","v":"S5x = m5∙y5 = 7.00x(-2.50) = -49.00 cm²"},null,null,null,null,null,null,null,null,null,null,null,null,null,{"$f":"IF(P12=\"arco circ.\",CONCATENATE(\"Xo\",O12,\" = \",FIXED(AS12),\" cm\"),\"\")","v":""}]
[null,{"$f":"CG12","v":"S5y = m5∙x5 = 7.00x(-7.00) = -49.00 cm²"},null,null,null,null,null,null,null,null,null,null,null,null,null,{"$f":"IF(P12=\"arco circ.\",CONCATENATE(\"Xo\",O12,\" = \",FIXED(AT12),\" cm\"),\"\")","v":""}]
[null,{"$f":"IF(P15=\"\",\"\",IF(P15=\"segmento\",#REF!,#REF!))","v":""}]
[null,{"$f":"IF(P15=\"\",\"\",IF(P15=\"segmento\",#REF!,BE15))","v":""}]
[null,{"$f":"IF(P15=\"\",\"\",IF(P15=\"segmento\",#REF!,BF15))","v":""}]
[]
[null,{"$f":"IF(P15=\"\",\"\",IF(P15=\"segmento\",#REF!,BG15))","v":""}]
[null,{"$f":"IF(P15=\"\",\"\",IF(P15=\"segmento\",#REF!,BH15))","v":""}]
[null,{"$f":"IF(P17=\"\",\"\",CONCATENATE(\"Fig. \",O17,\"  - \",P17))","v":""}]
[null,{"$f":"IF(P17=\"\",\"\",IF(P17=\"segmento\",#REF!,#REF!))","v":""}]
[null,{"$f":"IF(P17=\"\",\"\",IF(P17=\"segmento\",#REF!,BE17))","v":""}]
[null,{"$f":"IF(P17=\"\",\"\",IF(P17=\"segmento\",#REF!,BE17))","v":""}]
[]
[null,{"$f":"IF(P17=\"\",\"\",IF(P17=\"segmento\",#REF!,BG17))","v":""}]
[null,{"$f":"IF(P17=\"\",\"\",IF(P17=\"segmento\",#REF!,BH17))","v":""}]
[null,{"$f":"IF(P19=\"\",\"\",CONCATENATE(\"Fig. \",O19,\"  - \",P19))","v":""}]
[null,{"$f":"IF(P19=\"\",\"\",IF(P19=\"segmento\",#REF!,#REF!))","v":""}]
[null,{"$f":"IF(P19=\"\",\"\",IF(P19=\"segmento\",#REF!,BE19))","v":""}]
[null,{"$f":"IF(P19=\"\",\"\",IF(P39=\"segmento\",#REF!,BF19))","v":""}]
[]
[null,{"$f":"IF(P19=\"\",\"\",IF(P19=\"segmento\",#REF!,BG19))","v":""}]
[null,{"$f":"IF(P19=\"\",\"\",IF(P19=\"segmento\",#REF!,BH19))","v":""}]
[null,{"$f":"IF(P21=\"\",\"\",CONCATENATE(\"Fig. \",O21,\"  - \",P21))","v":""}]
[null,{"$f":"IF(P21=\"\",\"\",IF(P21=\"segmento\",#REF!,#REF!))","v":""}]
[null,{"$f":"IF(P21=\"\",\"\",IF(P21=\"segmento\",#REF!,BE21))","v":""}]
[null,{"$f":"IF(P21=\"\",\"\",IF(P46=\"segmento\",#REF!,BF21))","v":""}]
[]
[null,{"$f":"IF(P21=\"\",\"\",IF(P21=\"segmento\",#REF!,BG21))","v":""}]
[null,{"$f":"IF(P21=\"\",\"\",IF(P21=\"segmento\",#REF!,BH21))","v":""}]
[null,{"$f":"IF(P23=\"\",\"\",CONCATENATE(\"Fig. \",O23,\"  - \",P23))","v":""}]
[null,{"$f":"IF(P23=\"\",\"\",IF(P23=\"segmento\",#REF!,#REF!))","v":""}]
[null,{"$f":"IF(P23=\"\",\"\",IF(P23=\"segmento\",#REF!,BE23))","v":""}]
[null,{"$f":"IF(P23=\"\",\"\",IF(P53=\"segmento\",#REF!,BF23))","v":""}]
[]
[null,{"$f":"IF(P23=\"\",\"\",IF(P23=\"segmento\",#REF!,BG23))","v":""}]
[null,{"$f":"IF(P23=\"\",\"\",IF(P23=\"segmento\",#REF!,BH23))","v":""}]

{"sheet":"Foglio6","index":3,"n_rows":22,"n_cols":27,"rows_kept":22,"cut":false,"hidden":true,"merged":[]}
[null,null,{"$f":"'02'!BB2","v":"curva"},null,null,null,null,null,null,null,null,{"$f":"'02'!BK2","v":"segmento"}]
[null,null,{"$f":"'02'!BB3","v":"θ(OI)"},{"$f":"'02'!BC3","v":"P1"},{"$f":"'02'!BD3","v":"P2"},{"$f":"'02'!BE3","v":"P3"},{"$f":"'02'!BF3","v":"P4"},{"$f":"'02'!BG3","v":"P5"},{"$f":"'02'!BH3","v":"P6"},{"$f":"'02'!BI3","v":"P7"},null,{"$f":"'02'!BK3","v":"P1"},{"$f":"'02'!BL3","v":"P2"},{"$f":"'02'!BM3","v":"P3"},{"$f":"'02'!BN3","v":"P4"},{"$f":"'02'!BO3","v":"P5"},{"$f":"'02'!BP3","v":"P6"},{"$f":"'02'!BQ3","v":"P7"},null,"P1","P2","P3","P4","P5","P6","P7"]
[{"$f":"IF('02'!P4=\"\",\"\",('02'!P4))","v":"segmento"},{"$f":"'02'!BA4","v":"x"},{"$f":"'02'!BB4","v":{"$error":"#VALUE!"}},{"$f":"'02'!BC4","v":{"$error":"#VALUE!"}},{"$f":"'02'!BD4","v":{"$error":"#VALUE!"}},{"$f":"'02'!BE4","v":{"$error":"#VALUE!"}},{"$f":"'02'!BF4","v":{"$error":"#VALUE!"}},{"$f":"'02'!BG4","v":{"$error":"#VALUE!"}},{"$f":"'02'!BH4","v":{"$error":"#VALUE!"}},{"$f":"'02'!BI4","v":{"$error":"#VALUE!"}},null,{"$f":"'02'!BK4","v":-2},{"$f":"'02'!BL4","v":-0.33333333333333348},{"$f":"'02'!BM4","v":1.333333333333333},{"$f":"'02'!BN4","v":3},{"$f":"'02'!BO4","v":4.6666666666666661},{"$f":"'02'!BP4","v":6.3333333333333321},{"$f":"'02'!BQ4","v":8},null,{"$f":"IF(A3=\"\",\"\",IF(A3=\"segmento\",L3,D3))","v":-2},{"$f":"IF(A3=\"\",\"\",IF(A3=\"segmento\",M3,E3))","v":-0.33333333333333348},{"$f":"IF(A3=\"\",\"\",IF(A3=\"segmento\",N3,F3))","v":1.333333333333333},{"$f":"IF(A3=\"\",\"\",IF(A3=\"segmento\",O3,G3))","v":3},{"$f":"IF(A3=\"\",\"\",IF(A3=\"segmento\",P3,H3))","v":4.6666666666666661},{"$f":"IF(A3=\"\",\"\",IF(A3=\"segmento\",Q3,I3))","v":6.3333333333333321},{"$f":"IF(A3=\"\",\"\",IF(A3=\"segmento\",R3,J3))","v":8},"ab"]
[null,{"$f":"'02'!BA5","v":"y"},{"$f":"'02'!BB5","v":0},{"$f":"'02'!BC5","v":{"$error":"#VALUE!"}},{"$f":"'02'!BD5","v":{"$error":"#VALUE!"}},{"$f":"'02'!BE5","v":{"$error":"#VALUE!"}},{"$f":"'02'!BF5","v":{"$error":"#VALUE!"}},{"$f":"'02'!BG5","v":{"$error":"#VALUE!"}},{"$f":"'02'!BH5","v":{"$error":"#VALUE!"}},{"$f":"'02'!BI5","v":{"$error":"#VALUE!"}},null,{"$f":"'02'!BK5","v":5},{"$f":"'02'!BL5","v":5.166666666666667},{"$f":"'02'!BM5","v":5.333333333333333},{"$f":"'02'!BN5","v":5.5},{"$f":"'02'!BO5","v":5.666666666666667},{"$f":"'02'!BP5","v":5.833333333333333},{"$f":"'02'!BQ5","v":6},null,{"$f":"IF(A3=\"\",\"\",IF(A3=\"segmento\",L4,D4))","v":5},{"$f":"IF(A3=\"\",\"\",IF(A3=\"segmento\",M4,E4))","v":5.166666666666667},{"$f":"IF(A3=\"\",\"\",IF(A3=\"segmento\",N4,F4))","v":5.333333333333333},{"$f":"IF(A3=\"\",\"\",IF(A3=\"segmento\",O4,G4))","v":5.5},{"$f":"IF(A3=\"\",\"\",IF(A3=\"segmento\",P4,H4))","v":5.666666666666667},{"$f":"IF(A3=\"\",\"\",IF(A3=\"segmento\",Q4,I4))","v":5.833333333333333},{"$f":"IF(A3=\"\",\"\",IF(A3=\"segmento\",R4,J4))","v":6}]
[{"$f":"IF('02'!P6=\"\",\"\",('02'!P6))","v":"arco circ."},{"$f":"'02'!BA6","v":"x"},{"$f":"'02'!BB6","v":1.5707963267948966},{"$f":"'02'!BC6","v":7.9999999999999991},{"$f":"'02'!BD6","v":10.499999999999998},{"$f":"'02'!BE6","v":12.330127018922191},{"$f":"'02'!BF6","v":13},{"$f":"'02'!BG6","v":12.330127018922193},{"$f":"'02'!BH6","v":10.499999999999998},{"$f":"'02'!BI6","v":7.9999999999999991},null,{"$f":"'02'!BK6","v":8},{"$f":"'02'!BL6","v":8},{"$f":"'02'!BM6","v":7.9999999999999991},{"$f":"'02'!BN6","v":7.9999999999999991},{"$f":"'02'!BO6","v":7.9999999999999991},{"$f":"'02'!BP6","v":7.9999999999999982},{"$f":"'02'!BQ6","v":7.9999999999999982},null,{"$f":"IF(A5=\"\",\"\",IF(A5=\"segmento\",L5,D5))","v":7.9999999999999991},{"$f":"IF(A5=\"\",\"\",IF(A5=\"segmento\",M5,E5))","v":10.499999999999998},{"$f":"IF(A5=\"\",\"\",IF(A5=\"segmento\",N5,F5))","v":12.330127018922191},{"$f":"IF(A5=\"\",\"\",IF(A5=\"segmento\",O5,G5))","v":13},{"$f":"IF(A5=\"\",\"\",IF(A5=\"segmento\",P5,H5))","v":12.330127018922193},{"$f":"IF(A5=\"\",\"\",IF(A5=\"segmento\",Q5,I5))","v":10.499999999999998},{"$f":"IF(A5=\"\",\"\",IF(A5=\"segmento\",R5,J5))","v":7.9999999999999991},"bc"]
[null,{"$f":"'02'!BA7","v":"y"},{"$f":"'02'!BB7","v":0},{"$f":"'02'!BC7","v":6},{"$f":"'02'!BD7","v":5.3301270189221936},{"$f":"'02'!BE7","v":3.5},{"$f":"'02'!BF7","v":1},{"$f":"'02'!BG7","v":-1.4999999999999991},{"$f":"'02'!BH7","v":-3.3301270189221936},{"$f":"'02'!BI7","v":-4},null,{"$f":"'02'!BK7","v":6},{"$f":"'02'!BL7","v":4.333333333333333},{"$f":"'02'!BM7","v":2.6666666666666665},{"$f":"'02'!BN7","v":1},{"$f":"'02'!BO7","v":-0.66666666666666696},{"$f":"'02'!BP7","v":-2.3333333333333339},{"$f":"'02'!BQ7","v":-4},null,{"$f":"IF(A5=\"\",\"\",IF(A5=\"segmento\",L6,D6))","v":6},{"$f":"IF(A5=\"\",\"\",IF(A5=\"segmento\",M6,E6))","v":5.3301270189221936},{"$f":"IF(A5=\"\",\"\",IF(A5=\"segmento\",N6,F6))","v":3.5},{"$f":"IF(A5=\"\",\"\",IF(A5=\"segmento\",O6,G6))","v":1},{"$f":"IF(A5=\"\",\"\",IF(A5=\"segmento\",P6,H6))","v":-1.4999999999999991},{"$f":"IF(A5=\"\",\"\",IF(A5=\"segmento\",Q6,I6))","v":-3.3301270189221936},{"$f":"IF(A5=\"\",\"\",IF(A5=\"segmento\",R6,J6))","v":-4}]
[{"$f":"IF('02'!P8=\"\",\"\",('02'!P8))","v":"segmento"},{"$f":"'02'!BA8","v":"x"},{"$f":"'02'!BB8","v":{"$error":"#VALUE!"}},{"$f":"'02'!BC8","v":{"$error":"#VALUE!"}},{"$f":"'02'!BD8","v":{"$error":"#VALUE!"}},{"$f":"'02'!BE8","v":{"$error":"#VALUE!"}},{"$f":"'02'!BF8","v":{"$error":"#VALUE!"}},{"$f":"'02'!BG8","v":{"$error":"#VALUE!"}},{"$f":"'02'!BH8","v":{"$error":"#VALUE!"}},{"$f":"'02'!BI8","v":{"$error":"#VALUE!"}},null,{"$f":"'02'!BK8","v":8},{"$f":"'02'!BL8","v":6.833333333333333},{"$f":"'02'!BM8","v":5.6666666666666661},{"$f":"'02'!BN8","v":4.5},{"$f":"'02'!BO8","v":3.333333333333333},{"$f":"'02'!BP8","v":2.166666666666667},{"$f":"'02'!BQ8","v":1},null,{"$f":"IF(A7=\"\",\"\",IF(A7=\"segmento\",L7,D7))","v":8},{"$f":"IF(A7=\"\",\"\",IF(A7=\"segmento\",M7,E7))","v":6.833333333333333},{"$f":"IF(A7=\"\",\"\",IF(A7=\"segmento\",N7,F7))","v":5.6666666666666661},{"$f":"IF(A7=\"\",\"\",IF(A7=\"segmento\",O7,G7))","v":4.5},{"$f":"IF(A7=\"\",\"\",IF(A7=\"segmento\",P7,H7))","v":3.333333333333333},{"$f":"IF(A7=\"\",\"\",IF(A7=\"segmento\",Q7,I7))","v":2.166666666666667},{"$f":"IF(A7=\"\",\"\",IF(A7=\"segmento\",R7,J7))","v":1},"cd"]
[null,{"$f":"'02'!BA9","v":"y"},{"$f":"'02'!BB9","v":0},{"$f":"'02'!BC9","v":{"$error":"#VALUE!"}},{"$f":"'02'!BD9","v":{"$error":"#VALUE!"}},{"$f":"'02'!BE9","v":{"$error":"#VALUE!"}},{"$f":"'02'!BF9","v":{"$error":"#VALUE!"}},{"$f":"'02'!BG9","v":{"$error":"#VALUE!"}},{"$f":"'02'!BH9","v":{"$error":"#VALUE!"}},{"$f":"'02'!BI9","v":{"$error":"#VALUE!"}},null,{"$f":"'02'!BK9","v":-4},{"$f":"'02'!BL9","v":-4},{"$f":"'02'!BM9","v":-3.9999999999999996},{"$f":"'02'!BN9","v":-3.9999999999999996},{"$f":"'02'!BO9","v":-3.9999999999999996},{"$f":"'02'!BP9","v":-3.9999999999999991},{"$f":"'02'!BQ9","v":-3.9999999999999991},null,{"$f":"IF(A7=\"\",\"\",IF(A7=\"segmento\",L8,D8))","v":-4},{"$f":"IF(A7=\"\",\"\",IF(A7=\"segmento\",M8,E8))","v":-4},{"$f":"IF(A7=\"\",\"\",IF(A7=\"segmento\",N8,F8))","v":-3.9999999999999996},{"$f":"IF(A7=\"\",\"\",IF(A7=\"segmento\",O8,G8))","v":-3.9999999999999996},{"$f":"IF(A7=\"\",\"\",IF(A7=\"segmento\",P8,H8))","v":-3.9999999999999996},{"$f":"IF(A7=\"\",\"\",IF(A7=\"segmento\",Q8,I8))","v":-3.9999999999999991},{"$f":"IF(A7=\"\",\"\",IF(A7=\"segmento\",R8,J8))","v":-3.9999999999999991}]
[{"$f":"IF('02'!P10=\"\",\"\",('02'!P10))","v":"segmento"},{"$f":"'02'!BA10","v":"x"},{"$f":"'02'!BB10","v":{"$error":"#VALUE!"}},{"$f":"'02'!BC10","v":{"$error":"#VALUE!"}},{"$f":"'02'!BD10","v":{"$error":"#VALUE!"}},{"$f":"'02'!BE10","v":{"$error":"#VALUE!"}},{"$f":"'02'!BF10","v":{"$error":"#VALUE!"}},{"$f":"'02'!BG10","v":{"$error":"#VALUE!"}},{"$f":"'02'!BH10","v":{"$error":"#VALUE!"}},{"$f":"'02'!BI10","v":{"$error":"#VALUE!"}},null,{"$f":"'02'!BK10","v":1},{"$f":"'02'!BL10","v":-0.33333333333333326},{"$f":"'02'!BM10","v":-1.6666666666666665},{"$f":"'02'!BN10","v":-3},{"$f":"'02'!BO10","v":-4.333333333333333},{"$f":"'02'!BP10","v":-5.666666666666667},{"$f":"'02'!BQ10","v":-7},null,{"$f":"IF(A9=\"\",\"\",IF(A9=\"segmento\",L9,D9))","v":1},{"$f":"IF(A9=\"\",\"\",IF(A9=\"segmento\",M9,E9))","v":-0.33333333333333326},{"$f":"IF(A9=\"\",\"\",IF(A9=\"segmento\",N9,F9))","v":-1.6666666666666665},{"$f":"IF(A9=\"\",\"\",IF(A9=\"segmento\",O9,G9))","v":-3},{"$f":"IF(A9=\"\",\"\",IF(A9=\"segmento\",P9,H9))","v":-4.333333333333333},{"$f":"IF(A9=\"\",\"\",IF(A9=\"segmento\",Q9,I9))","v":-5.666666666666667},{"$f":"IF(A9=\"\",\"\",IF(A9=\"segmento\",R9,J9))","v":-7},"de"]
[null,{"$f":"'02'!BA11","v":"y"},{"$f":"'02'!BB11","v":0},{"$f":"'02'!BC11","v":{"$error":"#VALUE!"}},{"$f":"'02'!BD11","v":{"$error":"#VALUE!"}},{"$f":"'02'!BE11","v":{"$error":"#VALUE!"}},{"$f":"'02'!BF11","v":{"$error":"#VALUE!"}},{"$f":"'02'!BG11","v":{"$error":"#VALUE!"}},{"$f":"'02'!BH11","v":{"$error":"#VALUE!"}},{"$f":"'02'!BI11","v":{"$error":"#VALUE!"}},null,{"$f":"'02'!BK11","v":-4},{"$f":"'02'!BL11","v":-4.333333333333333},{"$f":"'02'!BM11","v":-4.6666666666666661},{"$f":"'02'!BN11","v":-5},{"$f":"'02'!BO11","v":-5.333333333333333},{"$f":"'02'!BP11","v":-5.6666666666666661},{"$f":"'02'!BQ11","v":-6},null,{"$f":"IF(A9=\"\",\"\",IF(A9=\"segmento\",L10,D10))","v":-4},{"$f":"IF(A9=\"\",\"\",IF(A9=\"segmento\",M10,E10))","v":-4.333333333333333},{"$f":"IF(A9=\"\",\"\",IF(A9=\"segmento\",N10,F10))","v":-4.6666666666666661},{"$f":"IF(A9=\"\",\"\",IF(A9=\"segmento\",O10,G10))","v":-5},{"$f":"IF(A9=\"\",\"\",IF(A9=\"segmento\",P10,H10))","v":-5.333333333333333},{"$f":"IF(A9=\"\",\"\",IF(A9=\"segmento\",Q10,I10))","v":-5.6666666666666661},{"$f":"IF(A9=\"\",\"\",IF(A9=\"segmento\",R10,J10))","v":-6}]
[{"$f":"IF('02'!P12=\"\",\"\",('02'!P12))","v":"segmento"},{"$f":"'02'!BA12","v":"x"},{"$f":"'02'!BB12","v":{"$error":"#VALUE!"}},{"$f":"'02'!BC12","v":{"$error":"#VALUE!"}},{"$f":"'02'!BD12","v":{"$error":"#VALUE!"}},{"$f":"'02'!BE12","v":{"$error":"#VALUE!"}},{"$f":"'02'!BF12","v":{"$error":"#VALUE!"}},{"$f":"'02'!BG12","v":{"$error":"#VALUE!"}},{"$f":"'02'!BH12","v":{"$error":"#VALUE!"}},{"$f":"'02'!BI12","v":{"$error":"#VALUE!"}},null,{"$f":"'02'!BK12","v":-7},{"$f":"'02'!BL12","v":-7},{"$f":"'02'!BM12","v":-7},{"$f":"'02'!BN12","v":-7},{"$f":"'02'!BO12","v":-7},{"$f":"'02'!BP12","v":-7},{"$f":"'02'!BQ12","v":-7},null,{"$f":"IF(A11=\"\",\"\",IF(A11=\"segmento\",L11,D11))","v":-7},{"$f":"IF(A11=\"\",\"\",IF(A11=\"segmento\",M11,E11))","v":-7},{"$f":"IF(A11=\"\",\"\",IF(A11=\"segmento\",N11,F11))","v":-7},{"$f":"IF(A11=\"\",\"\",IF(A11=\"segmento\",O11,G11))","v":-7},{"$f":"IF(A11=\"\",\"\",IF(A11=\"segmento\",P11,H11))","v":-7},{"$f":"IF(A11=\"\",\"\",IF(A11=\"segmento\",Q11,I11))","v":-7},{"$f":"IF(A11=\"\",\"\",IF(A11=\"segmento\",R11,J11))","v":-7},"ef"]
[null,{"$f":"'02'!BA13","v":"y"},{"$f":"'02'!BB13","v":0},{"$f":"'02'!BC13","v":{"$error":"#VALUE!"}},{"$f":"'02'!BD13","v":{"$error":"#VALUE!"}},{"$f":"'02'!BE13","v":{"$error":"#VALUE!"}},{"$f":"'02'!BF13","v":{"$error":"#VALUE!"}},{"$f":"'02'!BG13","v":{"$error":"#VALUE!"}},{"$f":"'02'!BH13","v":{"$error":"#VALUE!"}},{"$f":"'02'!BI13","v":{"$error":"#VALUE!"}},null,{"$f":"'02'!BK13","v":-6},{"$f":"'02'!BL13","v":-4.833333333333333},{"$f":"'02'!BM13","v":-3.6666666666666665},{"$f":"'02'!BN13","v":-2.5},{"$f":"'02'!BO13","v":-1.333333333333333},{"$f":"'02'!BP13","v":-0.16666666666666696},{"$f":"'02'!BQ13","v":1},null,{"$f":"IF(A11=\"\",\"\",IF(A11=\"segmento\",L12,D12))","v":-6},{"$f":"IF(A11=\"\",\"\",IF(A11=\"segmento\",M12,E12))","v":-4.833333333333333},{"$f":"IF(A11=\"\",\"\",IF(A11=\"segmento\",N12,F12))","v":-3.6666666666666665},{"$f":"IF(A11=\"\",\"\",IF(A11=\"segmento\",O12,G12))","v":-2.5},{"$f":"IF(A11=\"\",\"\",IF(A11=\"segmento\",P12,H12))","v":-1.333333333333333},{"$f":"IF(A11=\"\",\"\",IF(A11=\"segmento\",Q12,I12))","v":-0.16666666666666696},{"$f":"IF(A11=\"\",\"\",IF(A11=\"segmento\",R12,J12))","v":1}]
[{"$f":"IF('02'!P14=\"\",\"\",('02'!P14))","v":""},{"$f":"'02'!BA14","v":"x"},{"$f":"'02'!BB14","v":{"$error":"#VALUE!"}},{"$f":"'02'!BC14","v":{"$error":"#VALUE!"}},{"$f":"'02'!BD14","v":{"$error":"#VALUE!"}},{"$f":"'02'!BE14","v":{"$error":"#VALUE!"}},{"$f":"'02'!BF14","v":{"$error":"#VALUE!"}},{"$f":"'02'!BG14","v":{"$error":"#VALUE!"}},{"$f":"'02'!BH14","v":{"$error":"#VALUE!"}},{"$f":"'02'!BI14","v":{"$error":"#VALUE!"}},null,{"$f":"'02'!BK14","v":""},{"$f":"'02'!BL14","v":{"$error":"#VALUE!"}},{"$f":"'02'!BM14","v":{"$error":"#VALUE!"}},{"$f":"'02'!BN14","v":{"$error":"#VALUE!"}},{"$f":"'02'!BO14","v":{"$error":"#VALUE!"}},{"$f":"'02'!BP14","v":{"$error":"#VALUE!"}},{"$f":"'02'!BQ14","v":{"$error":"#VALUE!"}},null,{"$f":"IF(A13=\"\",\"\",IF(A13=\"segmento\",L13,D13))","v":""},{"$f":"IF(A13=\"\",\"\",IF(A13=\"segmento\",M13,E13))","v":""},{"$f":"IF(A13=\"\",\"\",IF(A13=\"segmento\",N13,F13))","v":""},{"$f":"IF(A13=\"\",\"\",IF(A13=\"segmento\",O13,G13))","v":""},{"$f":"IF(A13=\"\",\"\",IF(A13=\"segmento\",P13,H13))","v":""},{"$f":"IF(A13=\"\",\"\",IF(A13=\"segmento\",Q13,I13))","v":""},{"$f":"IF(A13=\"\",\"\",IF(A13=\"segmento\",R13,J13))","v":""},"fg"]
[null,{"$f":"'02'!BA15","v":"y"},{"$f":"'02'!BB15","v":0},{"$f":"'02'!BC15","v":{"$error":"#VALUE!"}},{"$f":"'02'!BD15","v":{"$error":"#VALUE!"}},{"$f":"'02'!BE15","v":{"$error":"#VALUE!"}},{"$f":"'02'!BF15","v":{"$error":"#VALUE!"}},{"$f":"'02'!BG15","v":{"$error":"#VALUE!"}},{"$f":"'02'!BH15","v":{"$error":"#VALUE!"}},{"$f":"'02'!BI15","v":{"$error":"#VALUE!"}},null,{"$f":"'02'!BK15","v":""},{"$f":"'02'!BL15","v":{"$error":"#VALUE!"}},{"$f":"'02'!BM15","v":{"$error":"#VALUE!"}},{"$f":"'02'!BN15","v":{"$error":"#VALUE!"}},{"$f":"'02'!BO15","v":{"$error":"#VALUE!"}},{"$f":"'02'!BP15","v":{"$error":"#VALUE!"}},{"$f":"'02'!BQ15","v":{"$error":"#VALUE!"}},null,{"$f":"IF(A13=\"\",\"\",IF(A13=\"segmento\",L14,D14))","v":""},{"$f":"IF(A13=\"\",\"\",IF(A13=\"segmento\",M14,E14))","v":""},{"$f":"IF(A13=\"\",\"\",IF(A13=\"segmento\",N14,F14))","v":""},{"$f":"IF(A13=\"\",\"\",IF(A13=\"segmento\",O14,G14))","v":""},{"$f":"IF(A13=\"\",\"\",IF(A13=\"segmento\",P14,H14))","v":""},{"$f":"IF(A13=\"\",\"\",IF(A13=\"segmento\",Q14,I14))","v":""},{"$f":"IF(A13=\"\",\"\",IF(A13=\"segmento\",R14,J14))","v":""}]
[{"$f":"IF('02'!P16=\"\",\"\",('02'!P16))","v":""},{"$f":"'02'!BA16","v":"x"},{"$f":"'02'!BB16","v":{"$error":"#VALUE!"}},{"$f":"'02'!BC16","v":{"$error":"#VALUE!"}},{"$f":"'02'!BD16","v":{"$error":"#VALUE!"}},{"$f":"'02'!BE16","v":{"$error":"#VALUE!"}},{"$f":"'02'!BF16","v":{"$error":"#VALUE!"}},{"$f":"'02'!BG16","v":{"$error":"#VALUE!"}},{"$f":"'02'!BH16","v":{"$error":"#VALUE!"}},{"$f":"'02'!BI16","v":{"$error":"#VALUE!"}},null,{"$f":"'02'!BK16","v":""},{"$f":"'02'!BL16","v":{"$error":"#VALUE!"}},{"$f":"'02'!BM16","v":{"$error":"#VALUE!"}},{"$f":"'02'!BN16","v":{"$error":"#VALUE!"}},{"$f":"'02'!BO16","v":{"$error":"#VALUE!"}},{"$f":"'02'!BP16","v":{"$error":"#VALUE!"}},{"$f":"'02'!BQ16","v":{"$error":"#VALUE!"}},null,{"$f":"IF(A15=\"\",\"\",IF(A15=\"segmento\",L15,D15))","v":""},{"$f":"IF(A15=\"\",\"\",IF(A15=\"segmento\",M15,E15))","v":""},{"$f":"IF(A15=\"\",\"\",IF(A15=\"segmento\",N15,F15))","v":""},{"$f":"IF(A15=\"\",\"\",IF(A15=\"segmento\",O15,G15))","v":""},{"$f":"IF(A15=\"\",\"\",IF(A15=\"segmento\",P15,H15))","v":""},{"$f":"IF(A15=\"\",\"\",IF(A15=\"segmento\",Q15,I15))","v":""},{"$f":"IF(A15=\"\",\"\",IF(A15=\"segmento\",R15,J15))","v":""},"gh"]
[null,{"$f":"'02'!BA17","v":"y"},{"$f":"'02'!BB17","v":0},{"$f":"'02'!BC17","v":{"$error":"#VALUE!"}},{"$f":"'02'!BD17","v":{"$error":"#VALUE!"}},{"$f":"'02'!BE17","v":{"$error":"#VALUE!"}},{"$f":"'02'!BF17","v":{"$error":"#VALUE!"}},{"$f":"'02'!BG17","v":{"$error":"#VALUE!"}},{"$f":"'02'!BH17","v":{"$error":"#VALUE!"}},{"$f":"'02'!BI17","v":{"$error":"#VALUE!"}},null,{"$f":"'02'!BK17","v":""},{"$f":"'02'!BL17","v":{"$error":"#VALUE!"}},{"$f":"'02'!BM17","v":{"$error":"#VALUE!"}},{"$f":"'02'!BN17","v":{"$error":"#VALUE!"}},{"$f":"'02'!BO17","v":{"$error":"#VALUE!"}},{"$f":"'02'!BP17","v":{"$error":"#VALUE!"}},{"$f":"'02'!BQ17","v":{"$error":"#VALUE!"}},null,{"$f":"IF(A15=\"\",\"\",IF(A15=\"segmento\",L16,D16))","v":""},{"$f":"IF(A15=\"\",\"\",IF(A15=\"segmento\",M16,E16))","v":""},{"$f":"IF(A15=\"\",\"\",IF(A15=\"segmento\",N16,F16))","v":""},{"$f":"IF(A15=\"\",\"\",IF(A15=\"segmento\",O16,G16))","v":""},{"$f":"IF(A15=\"\",\"\",IF(A15=\"segmento\",P16,H16))","v":""},{"$f":"IF(A15=\"\",\"\",IF(A15=\"segmento\",Q16,I16))","v":""},{"$f":"IF(A15=\"\",\"\",IF(A15=\"segmento\",R16,J16))","v":""}]
[{"$f":"IF('02'!P18=\"\",\"\",('02'!P18))","v":""},{"$f":"'02'!BA18","v":"x"},{"$f":"'02'!BB18","v":{"$error":"#VALUE!"}},{"$f":"'02'!BC18","v":{"$error":"#VALUE!"}},{"$f":"'02'!BD18","v":{"$error":"#VALUE!"}},{"$f":"'02'!BE18","v":{"$error":"#VALUE!"}},{"$f":"'02'!BF18","v":{"$error":"#VALUE!"}},{"$f":"'02'!BG18","v":{"$error":"#VALUE!"}},{"$f":"'02'!BH18","v":{"$error":"#VALUE!"}},{"$f":"'02'!BI18","v":{"$error":"#VALUE!"}},null,{"$f":"'02'!BK18","v":""},{"$f":"'02'!BL18","v":{"$error":"#VALUE!"}},{"$f":"'02'!BM18","v":{"$error":"#VALUE!"}},{"$f":"'02'!BN18","v":{"$error":"#VALUE!"}},{"$f":"'02'!BO18","v":{"$error":"#VALUE!"}},{"$f":"'02'!BP18","v":{"$error":"#VALUE!"}},{"$f":"'02'!BQ18","v":{"$error":"#VALUE!"}},null,{"$f":"IF(A17=\"\",\"\",IF(A17=\"segmento\",L17,D17))","v":""},{"$f":"IF(A17=\"\",\"\",IF(A17=\"segmento\",M17,E17))","v":""},{"$f":"IF(A17=\"\",\"\",IF(A17=\"segmento\",N17,F17))","v":""},{"$f":"IF(A17=\"\",\"\",IF(A17=\"segmento\",O17,G17))","v":""},{"$f":"IF(A17=\"\",\"\",IF(A17=\"segmento\",P17,H17))","v":""},{"$f":"IF(A17=\"\",\"\",IF(A17=\"segmento\",Q17,I17))","v":""},{"$f":"IF(A17=\"\",\"\",IF(A17=\"segmento\",R17,J17))","v":""},"hi"]
[null,{"$f":"'02'!BA19","v":"y"},{"$f":"'02'!BB19","v":0},{"$f":"'02'!BC19","v":{"$error":"#VALUE!"}},{"$f":"'02'!BD19","v":{"$error":"#VALUE!"}},{"$f":"'02'!BE19","v":{"$error":"#VALUE!"}},{"$f":"'02'!BF19","v":{"$error":"#VALUE!"}},{"$f":"'02'!BG19","v":{"$error":"#VALUE!"}},{"$f":"'02'!BH19","v":{"$error":"#VALUE!"}},{"$f":"'02'!BI19","v":{"$error":"#VALUE!"}},null,{"$f":"'02'!BK19","v":""},{"$f":"'02'!BL19","v":{"$error":"#VALUE!"}},{"$f":"'02'!BM19","v":{"$error":"#VALUE!"}},{"$f":"'02'!BN19","v":{"$error":"#VALUE!"}},{"$f":"'02'!BO19","v":{"$error":"#VALUE!"}},{"$f":"'02'!BP19","v":{"$error":"#VALUE!"}},{"$f":"'02'!BQ19","v":{"$error":"#VALUE!"}},null,{"$f":"IF(A17=\"\",\"\",IF(A17=\"segmento\",L18,D18))","v":""},{"$f":"IF(A17=\"\",\"\",IF(A17=\"segmento\",M18,E18))","v":""},{"$f":"IF(A17=\"\",\"\",IF(A17=\"segmento\",N18,F18))","v":""},{"$f":"IF(A17=\"\",\"\",IF(A17=\"segmento\",O18,G18))","v":""},{"$f":"IF(A17=\"\",\"\",IF(A17=\"segmento\",P18,H18))","v":""},{"$f":"IF(A17=\"\",\"\",IF(A17=\"segmento\",Q18,I18))","v":""},{"$f":"IF(A17=\"\",\"\",IF(A17=\"segmento\",R18,J18))","v":""}]
[{"$f":"IF('02'!P20=\"\",\"\",('02'!P20))","v":""},{"$f":"'02'!BA20","v":"x"},{"$f":"'02'!BB20","v":{"$error":"#VALUE!"}},{"$f":"'02'!BC20","v":{"$error":"#VALUE!"}},{"$f":"'02'!BD20","v":{"$error":"#VALUE!"}},{"$f":"'02'!BE20","v":{"$error":"#VALUE!"}},{"$f":"'02'!BF20","v":{"$error":"#VALUE!"}},{"$f":"'02'!BG20","v":{"$error":"#VALUE!"}},{"$f":"'02'!BH20","v":{"$error":"#VALUE!"}},{"$f":"'02'!BI20","v":{"$error":"#VALUE!"}},null,{"$f":"'02'!BK20","v":""},{"$f":"'02'!BL20","v":{"$error":"#VALUE!"}},{"$f":"'02'!BM20","v":{"$error":"#VALUE!"}},{"$f":"'02'!BN20","v":{"$error":"#VALUE!"}},{"$f":"'02'!BO20","v":{"$error":"#VALUE!"}},{"$f":"'02'!BP20","v":{"$error":"#VALUE!"}},{"$f":"'02'!BQ20","v":{"$error":"#VALUE!"}},null,{"$f":"IF(A19=\"\",\"\",IF(A19=\"segmento\",L19,D19))","v":""},{"$f":"IF(A19=\"\",\"\",IF(A19=\"segmento\",M19,E19))","v":""},{"$f":"IF(A19=\"\",\"\",IF(A19=\"segmento\",N19,F19))","v":""},{"$f":"IF(A19=\"\",\"\",IF(A19=\"segmento\",O19,G19))","v":""},{"$f":"IF(A19=\"\",\"\",IF(A19=\"segmento\",P19,H19))","v":""},{"$f":"IF(A19=\"\",\"\",IF(A19=\"segmento\",Q19,I19))","v":""},{"$f":"IF(A19=\"\",\"\",IF(A19=\"segmento\",R19,J19))","v":""},"il"]
[null,{"$f":"'02'!BA21","v":"y"},{"$f":"'02'!BB21","v":0},{"$f":"'02'!BC21","v":{"$error":"#VALUE!"}},{"$f":"'02'!BD21","v":{"$error":"#VALUE!"}},{"$f":"'02'!BE21","v":{"$error":"#VALUE!"}},{"$f":"'02'!BF21","v":{"$error":"#VALUE!"}},{"$f":"'02'!BG21","v":{"$error":"#VALUE!"}},{"$f":"'02'!BH21","v":{"$error":"#VALUE!"}},{"$f":"'02'!BI21","v":{"$error":"#VALUE!"}},null,{"$f":"'02'!BK21","v":""},{"$f":"'02'!BL21","v":{"$error":"#VALUE!"}},{"$f":"'02'!BM21","v":{"$error":"#VALUE!"}},{"$f":"'02'!BN21","v":{"$error":"#VALUE!"}},{"$f":"'02'!BO21","v":{"$error":"#VALUE!"}},{"$f":"'02'!BP21","v":{"$error":"#VALUE!"}},{"$f":"'02'!BQ21","v":{"$error":"#VALUE!"}},null,{"$f":"IF(A19=\"\",\"\",IF(A19=\"segmento\",L20,D20))","v":""},{"$f":"IF(A19=\"\",\"\",IF(A19=\"segmento\",M20,E20))","v":""},{"$f":"IF(A19=\"\",\"\",IF(A19=\"segmento\",N20,F20))","v":""},{"$f":"IF(A19=\"\",\"\",IF(A19=\"segmento\",O20,G20))","v":""},{"$f":"IF(A19=\"\",\"\",IF(A19=\"segmento\",P20,H20))","v":""},{"$f":"IF(A19=\"\",\"\",IF(A19=\"segmento\",Q20,I20))","v":""},{"$f":"IF(A19=\"\",\"\",IF(A19=\"segmento\",R20,J20))","v":""}]
[{"$f":"IF('02'!P22=\"\",\"\",('02'!P22))","v":""},{"$f":"'02'!BA22","v":"x"},{"$f":"'02'!BB22","v":{"$error":"#VALUE!"}},{"$f":"'02'!BC22","v":{"$error":"#VALUE!"}},{"$f":"'02'!BD22","v":{"$error":"#VALUE!"}},{"$f":"'02'!BE22","v":{"$error":"#VALUE!"}},{"$f":"'02'!BF22","v":{"$error":"#VALUE!"}},{"$f":"'02'!BG22","v":{"$error":"#VALUE!"}},{"$f":"'02'!BH22","v":{"$error":"#VALUE!"}},{"$f":"'02'!BI22","v":{"$error":"#VALUE!"}},null,{"$f":"'02'!BK22","v":""},{"$f":"'02'!BL22","v":{"$error":"#VALUE!"}},{"$f":"'02'!BM22","v":{"$error":"#VALUE!"}},{"$f":"'02'!BN22","v":{"$error":"#VALUE!"}},{"$f":"'02'!BO22","v":{"$error":"#VALUE!"}},{"$f":"'02'!BP22","v":{"$error":"#VALUE!"}},{"$f":"'02'!BQ22","v":{"$error":"#VALUE!"}},null,{"$f":"IF(A21=\"\",\"\",IF(A21=\"segmento\",L21,D21))","v":""},{"$f":"IF(A21=\"\",\"\",IF(A21=\"segmento\",M21,E21))","v":""},{"$f":"IF(A21=\"\",\"\",IF(A21=\"segmento\",N21,F21))","v":""},{"$f":"IF(A21=\"\",\"\",IF(A21=\"segmento\",O21,G21))","v":""},{"$f":"IF(A21=\"\",\"\",IF(A21=\"segmento\",P21,H21))","v":""},{"$f":"IF(A21=\"\",\"\",IF(A21=\"segmento\",Q21,I21))","v":""},{"$f":"IF(A21=\"\",\"\",IF(A21=\"segmento\",R21,J21))","v":""},"lm"]
[null,{"$f":"'02'!BA23","v":"y"},{"$f":"'02'!BB23","v":0},{"$f":"'02'!BC23","v":{"$error":"#VALUE!"}},{"$f":"'02'!BD23","v":{"$error":"#VALUE!"}},{"$f":"'02'!BE23","v":{"$error":"#VALUE!"}},{"$f":"'02'!BF23","v":{"$error":"#VALUE!"}},{"$f":"'02'!BG23","v":{"$error":"#VALUE!"}},{"$f":"'02'!BH23","v":{"$error":"#VALUE!"}},{"$f":"'02'!BI23","v":{"$error":"#VALUE!"}},null,{"$f":"'02'!BK23","v":""},{"$f":"'02'!BL23","v":{"$error":"#VALUE!"}},{"$f":"'02'!BM23","v":{"$error":"#VALUE!"}},{"$f":"'02'!BN23","v":{"$error":"#VALUE!"}},{"$f":"'02'!BO23","v":{"$error":"#VALUE!"}},{"$f":"'02'!BP23","v":{"$error":"#VALUE!"}},{"$f":"'02'!BQ23","v":{"$error":"#VALUE!"}},null,{"$f":"IF(A21=\"\",\"\",IF(A21=\"segmento\",L22,D22))","v":""},{"$f":"IF(A21=\"\",\"\",IF(A21=\"segmento\",M22,E22))","v":""},{"$f":"IF(A21=\"\",\"\",IF(A21=\"segmento\",N22,F22))","v":""},{"$f":"IF(A21=\"\",\"\",IF(A21=\"segmento\",O22,G22))","v":""},{"$f":"IF(A21=\"\",\"\",IF(A21=\"segmento\",P22,H22))","v":""},{"$f":"IF(A21=\"\",\"\",IF(A21=\"segmento\",Q22,I22))","v":""},{"$f":"IF(A21=\"\",\"\",IF(A21=\"segmento\",R22,J22))","v":""}]